program: Gaussian 09
title: 000247685
version: EM64L-G09RevD.01
frameworkgroup: C1[X(C8H11NO2S)]
method: RPBEPBE
basis: SDD
operation: Freq
keyword: #p
keyword: freq=noraman
keyword: PBEPBE/SDD
title: #p freq=noraman PBEPBE/SDD
converged: YES YES NO NO
title: Mulliken charges:
elementType: S O O N C C C C C C C C H H H H H H H H H H H
charge: 0.105106 -0.221219 -0.232518 -0.324836 -0.469456 0.349734 -0.406975 -0.598167 -0.013795 -0.252053 -0.166106 -0.617317 0.272160 0.242766 0.325240 0.261445 0.251049 0.294966 0.255089 0.261555 0.244968 0.222541 0.215825
chargesum: 0.00000
title: Mulliken charges with hydrogens summed into heavy atoms:
elementType: S O O N C C C C C C C C
charge: 0.105106 -0.221219 -0.232518 0.000404 0.045470 0.349734 -0.145530 -0.052152 -0.013795 0.003035 0.095449 0.066016
polarizability: 1.72603627e+02 8.03924677e-01 9.32099888e+01 -1.13811094e+01 -2.04155233e+00 8.78567302e+01
1716.lowfreq: -15.4555 -4.6599 -0.0020 0.0013 0.0020 4.5833 10.5913 28.0466 38.5656
frequency: 7.5890 27.9903 38.5614 49.5893 59.7202 154.5803 169.9112 219.0433 253.8122 276.1167 301.2864 326.4460 420.2414 448.3847 547.6907 594.3045 612.6924 620.9754 626.9499 694.4165 736.0736 757.0610 806.5486 822.5381 868.1277 877.2528 880.3039 962.7374 982.2583 1008.7619 1025.8007 1048.3719 1061.7725 1069.3073 1134.6319 1168.5557 1185.9988 1223.6049 1255.0777 1258.6051 1284.1315 1341.1849 1366.8711 1389.2718 1433.5267 1463.8001 1464.4005 1472.3406 1477.2971 1487.9765 1589.6988 1647.3717 2981.0889 2994.9265 3031.1645 3060.9754 3074.8232 3090.3460 3116.9329 3217.8089 3233.5372 3269.2015 3546.6118
redmass: 3.9687 2.9298 5.4465 5.5674 5.6732 2.2776 4.3221 1.8290 3.2710 2.7805 2.5498 3.2460 5.6151 5.4201 1.3311 3.1484 5.1518 5.2701 5.4560 5.1514 1.2682 1.1734 3.5588 1.3378 5.8467 2.3369 1.9062 2.2002 1.7480 2.3686 2.1475 3.1796 1.3751 2.3408 1.5565 2.6789 1.8087 1.9755 1.2171 1.3685 1.2000 1.4103 2.2638 1.2079 1.0929 1.0810 1.1135 1.4947 1.0464 4.7351 6.8021 8.4675 1.0372 1.0629 1.0593 1.0987 1.0958 1.1021 1.1057 1.0934 1.0979 1.1084 1.0782
irintensity: 0.1530 0.0371 0.3006 4.0941 6.3020 0.6088 0.9281 7.6447 0.6175 22.7903 4.4642 2.9867 28.8622 2.0517 117.5663 5.2117 6.3747 16.2664 17.2867 25.7498 86.6975 9.5032 48.0431 21.8248 4.9691 4.0132 2.4555 31.0321 31.9040 25.9025 22.6749 0.3187 0.5139 6.1159 15.2318 306.6667 9.0189 7.9726 14.0929 17.1984 7.5007 10.4807 7.5019 17.2929 15.9621 36.6437 82.4600 223.9513 8.5231 23.9743 2.7391 216.8938 34.7574 38.0285 17.6701 4.6286 34.4957 8.7189 15.8898 4.3326 0.3111 0.3448 33.2066
temp: 298.150 k
press: 1.00000 atm
elementType: 16 8 8 7 6 6 6 6 6 6 6 6 1 1 1 1 1 1 1 1 1 1 1
symmnumber: 1
zpe: 470245.9 jmol-1
zpe.correction: 0.179107 hartree
zpe.thermalcorrener: 0.192179 hartree
zpe.thermalcorrenthalpy: 0.193123 hartree
zpe.thermalcorrgfe: 0.135146 hartree
zpe.sumelectzpe: -913.787174 hartree
zpe.sumelectthermal: -913.774102 hartree
zpe.sumelectthermalent: -913.773158 hartree
zpe.sumelectthermalfe: -913.831136 hartree
dipole: 2.0406 0.0916 -2.0689
dipole: 2.9073
quadrupole: -62.1424 -77.9190 -80.4355
quadrupole: 0.5656 -2.8652 -4.7500
quadrupole: 11.3565 -4.4200 -6.9365 0.5656 -2.8652 -4.7500
hfenergy: -913.9662815 hartree
pointgroup: C01 [X(C8H11N1O2S1)]
dipole: -0.774417 0.1055966 -0.8351466 debye
dipolederiv: -0.7768772 -0.1736708 0.0028251 -0.4811139 -0.459934 -0.0000802 0.0339879 0.0980876 -0.1865538 -0.4842313 0.0242537 -0.2020449 0.0621662 -0.223608 -0.129552 -0.1685716 -0.154768 -0.44573 -0.7390584 -0.0403769 -0.1282582 -0.1064254 -0.8188102 0.3719383 -0.1816536 0.3736738 -0.6513259 -1.7021447 -0.155224 -0.2784395 -0.2500507 -0.4327122 -0.1351686 -0.3392897 -0.129623 -0.4655171 0.7698057 0.128943 0.0215401 0.391863 0.4146959 0.09398 -0.3230704 0.0508126 0.1696218 0.1465319 -0.0589259 0.1176767 -0.1056622 -0.0102783 0.1363015 0.1226262 0.158674 0.2875694 -0.1193592 -0.0636359 -0.046564 -0.0699916 -0.1223226 0.0987124 -0.0130591 0.0853639 -0.0871022 0.5425778 -0.0635385 0.0948178 -0.1565913 0.1100904 0.0380363 0.2102527 0.0675343 0.0853684 1.906889 0.4753221 0.4188766 0.7144629 1.0532459 -0.3964654 0.5640443 -0.4141485 0.7284919 -0.0392509 -0.0737597 0.0234522 -0.0389169 -0.1515733 0.0347208 0.034475 0.0451049 -0.1457971 0.1519288 -0.0484802 0.1727455 0.0120912 -0.0621475 0.0964292 0.2002178 0.0845729 0.121892 -0.1163041 0.0530669 0.0247698 0.0706734 -0.0147505 -0.0512296 -0.0801998 -0.0592045 0.0105496 0.0708351 0.0666957 -0.0337602 -0.0346944 0.088207 0.0149489 0.0423224 0.0709619 0.0263167 -0.0493023 -0.0503046 -0.0277922 -0.1133259 -0.0325955 -0.0979833 -0.0007887 -0.1423218 -0.0162682 0.2513493 -0.0766383 -0.0312907 -0.1013207 0.1621271 0.0805527 -0.0325987 0.0822874 0.243316 0.1465109 0.0313857 0.008218 0.0286943 0.1198349 -0.1053017 0.0065519 -0.0999101 0.0336604 -0.0483711 -0.0481928 -0.0498291 -0.0218998 -0.0725402 -0.0837236 -0.0478776 -0.0578722 0.0781926 0.0244762 0.0191865 0.0426888 0.0836178 0.0809105 0.0804092 0.0126015 0.0151232 -0.0234988 -0.0283276 0.0504118 -0.0517509 0.0583829 0.1704867 -0.0222994 -0.0605504 -0.0192991 0.1352765 0.0864023 0.0442172 -0.0046747 0.0604371 0.1443483 -0.0846074 0.0097496 -0.0911158 0.0812703 0.0797612 -0.1068903 -0.0243394 -0.064189 -0.0645592 -0.0632037 -0.0031134 -0.0472099 0.0741147 0.0820911 0.001396 0.0589374 -0.0524446 0.0299372 0.1014724 0.1141662 0.0651718 -0.069961 -0.1559325 0.0647593 -0.1078039 0.1142375 0.0919475 0.0221129 -0.1002227 0.0181045 0.0161138 unknown
polarizability: 171.2785105|3.5669626|92.0551864|14.8084864|4.0238148|90.3366489 unknown
InChI: InChI=1S/C8H11NO2S/c1-2-12-8(10)9-6-7-4-3-5-11-7/h3-5,9H,2,6H2,1H3
charge 0 multiplicity 1
23 atoms
S  2.703971 1.524789 -0.334361
O  -2.304779 0.455183 0.783774
O  1.928264 -0.806593 0.965267
N  0.435802 0.06643 -0.608223
C  -0.618705 -0.948585 -0.387501
C  -1.991893 -0.356901 -0.330819
C  -3.102579 -0.442857 -1.157577
C  4.226816 1.019601 0.676467
C  1.610585 0.058906 0.109356
C  -4.158178 0.341687 -0.548314
C  -3.637798 0.870218 0.619899
C  5.191224 0.128946 -0.116458
H  -0.359207 -1.465163 0.55399
H  -0.60202 -1.704015 -1.196531
H  0.266214 0.806892 -1.292009
H  -3.162184 -1.001983 -2.089791
H  4.6847 1.973023 0.987571
H  3.826267 0.494514 1.559945
H  -5.166187 0.490605 -0.929709
H  -4.029242 1.512326 1.403757
H  4.699459 -0.817185 -0.399929
H  5.545717 0.628849 -1.034734
H  6.073652 -0.117686 0.505433
