program: Gaussian 09
title: 000247687
version: EM64L-G09RevD.01
frameworkgroup: C1[X(C11H15NO2S)]
method: RPBEPBE
basis: SDD
operation: Freq
keyword: #p
keyword: freq=noraman
keyword: PBEPBE/SDD
title: #p freq=noraman PBEPBE/SDD
converged: YES YES NO NO
title: Mulliken charges:
elementType: S O O N C C C C C C C C C C C H H H H H H H H H H H H H H H
charge: 0.093743 -0.264136 -0.221405 -0.401552 0.478922 0.344206 -0.452234 -0.319767 -0.330142 -0.369967 -0.244521 -0.074710 -0.684417 -0.596959 -0.615982 0.219886 0.299180 0.246579 0.250833 0.321827 0.206864 0.206479 0.253586 0.296079 0.206720 0.232801 0.232962 0.244630 0.223407 0.217091
chargesum: 0.00000
title: Mulliken charges with hydrogens summed into heavy atoms:
elementType: S O O N C C C C C C C C C C C
charge: 0.093743 -0.264136 -0.221405 -0.079725 0.478922 0.344206 -0.232348 -0.020587 -0.083563 -0.119134 0.168822 -0.074710 -0.011935 -0.047295 0.069145
polarizability: 2.80853484e+02 1.97538347e+00 1.39792323e+02 3.08835714e+00 5.11934674e+00 8.21760039e+01
1716.lowfreq: -19.6920 -6.9287 -0.0025 -0.0012 -0.0008 5.9671 16.5242 26.3021 33.6744
frequency: 7.1470 26.1585 33.6436 59.1194 77.6072 81.9066 113.4167 143.5701 175.3848 201.7191 204.9551 242.2921 263.8585 304.2228 330.7010 364.8309 369.6262 414.0649 416.2769 450.9283 519.2604 558.2153 607.1660 615.5560 623.1212 629.4784 718.2927 731.2600 758.9912 797.8268 802.0895 829.7103 848.0996 850.8682 903.0067 920.2783 978.3433 982.0923 999.6074 1037.9648 1059.4134 1069.7061 1114.8788 1116.2203 1130.1392 1136.4653 1184.2014 1219.1331 1257.0332 1262.0841 1264.0012 1285.9362 1307.6568 1360.1840 1375.3610 1391.0334 1399.4983 1425.6465 1434.3448 1460.6370 1464.3875 1476.6511 1477.2107 1487.1526 1500.3461 1508.8507 1593.4622 1630.2074 1650.6314 2949.9127 2982.3349 2997.3059 3007.3009 3029.5847 3076.0953 3089.9689 3094.6651 3106.2976 3115.6433 3116.1998 3161.8197 3167.4535 3194.8181 3515.3751
redmass: 2.9691 3.1314 4.9099 7.4096 4.1071 3.9624 1.8017 2.9449 5.3243 1.8015 5.6563 1.2041 1.7123 3.7464 4.0022 5.6352 4.9785 3.0562 5.0222 7.1011 2.4107 6.0930 8.2700 3.4795 1.4486 7.0658 3.6493 4.6130 1.1894 1.3415 6.3240 1.1127 1.4988 6.3368 3.2960 1.3804 1.3141 1.7608 2.8091 2.8350 1.3795 2.1750 2.6558 2.3906 1.4950 1.4416 1.2726 2.3006 1.2361 1.1532 2.5192 1.1970 1.3443 2.0362 2.1679 1.2079 1.2882 3.9635 1.0919 1.0400 1.0402 1.0865 1.0466 1.1791 1.7961 2.2036 5.4183 6.3789 6.9447 1.0552 1.0371 1.0362 1.1075 1.0595 1.0960 1.1023 1.0989 1.1013 1.0899 1.1054 1.0904 1.0933 1.0954 1.0765
irintensity: 0.6759 2.5170 0.0348 1.4491 2.8911 2.8024 4.1455 0.0378 0.1510 12.5285 0.9064 0.6821 7.1981 2.3509 2.4320 4.4583 3.7875 0.0433 9.8238 8.3853 34.5309 43.8120 4.7370 19.1624 63.4509 1.2954 0.0143 1.6092 9.8811 47.6360 72.9501 0.2036 67.7805 46.4940 47.1367 1.8246 1.1208 43.4137 2.3150 88.1382 4.5538 9.0291 216.2085 34.7843 36.4519 4.4861 79.7735 326.1061 6.2412 0.2243 7.8077 13.3925 7.8088 24.1734 129.3113 16.3233 61.4569 10.3333 24.1013 11.9034 14.1417 60.7852 8.3360 74.5675 5.2455 572.7510 56.6072 4.9861 183.2967 45.0542 34.9387 28.5313 39.6381 20.3895 34.8378 8.6541 29.8322 34.4053 21.3656 16.3042 4.6740 13.9092 3.0196 20.9270
temp: 298.150 k
press: 1.00000 atm
elementType: 16 8 8 7 6 6 6 6 6 6 6 6 6 6 6 1 1 1 1 1 1 1 1 1 1 1 1 1 1 1
symmnumber: 1
zpe: 631867.0 jmol-1
zpe.correction: 0.240665 hartree
zpe.thermalcorrener: 0.257157 hartree
zpe.thermalcorrenthalpy: 0.258101 hartree
zpe.thermalcorrgfe: 0.192874 hartree
zpe.sumelectzpe: -1030.306908 hartree
zpe.sumelectthermal: -1030.290417 hartree
zpe.sumelectthermalent: -1030.289472 hartree
zpe.sumelectthermalfe: -1030.354700 hartree
dipole: 1.7094 2.7198 0.8542
dipole: 3.3240
quadrupole: -74.5634 -93.8082 -100.9828
quadrupole: 7.5478 0.2961 0.9476
quadrupole: 15.2214 -4.0234 -11.1980 7.5478 0.2961 0.9476
hfenergy: -1030.5475738 hartree
pointgroup: C01 [X(C11H15N1O2S1)]
dipole: 0.7032872 1.1013055 0.0526285 debye
polarizability: 280.5625563|-1.031834|138.132199|8.3368597|-10.9182115|84.1270559 unknown
InChI: InChI=1S/C11H15NO2S/c1-3-14-10-7-5-9(6-8-10)12-11(13)15-4-2/h5-8,12H,3-4H2,1-2H3
charge 0 multiplicity 1
30 atoms
S  -4.270003 1.113937 -0.898558
O  3.826748 -0.65593 0.03541
O  -2.779148 -1.175981 -0.389312
N  -1.60035 0.858253 -0.581046
C  -0.239405 0.450171 -0.42403
C  2.504109 -0.214325 -0.126422
C  0.756821 1.454989 -0.485968
C  0.147776 -0.90155 -0.210755
C  2.122672 1.134085 -0.339211
C  1.508387 -1.220721 -0.064931
C  4.899318 0.356188 -0.021299
C  -2.73267 0.066364 -0.572721
C  6.217388 -0.384338 0.187802
C  -5.566868 -0.231697 -0.585208
C  -6.040508 -0.265941 0.873284
H  0.470128 2.501497 -0.651864
H  -0.614394 -1.681157 -0.160869
H  2.865568 1.93474 -0.393206
H  1.822454 -2.255885 0.100142
H  -1.752152 1.861526 -0.717248
H  4.875071 0.864955 -1.007549
H  4.733881 1.115034 0.771789
H  -6.381822 -0.008366 -1.293003
H  -5.074736 -1.176517 -0.872858
H  7.062615 0.326977 0.153886
H  6.226402 -0.893128 1.166706
H  6.366114 -1.143475 -0.598836
H  -5.20141 -0.501674 1.549798
H  -6.478332 0.699062 1.182725
H  -6.811751 -1.050492 0.998855
