program: Gaussian 09
title: 000247691
version: EM64L-G09RevD.01
frameworkgroup: C1[X(C10H11N3OS2)]
method: RPBEPBE
basis: SDD
operation: Freq
keyword: #p
keyword: freq=noraman
keyword: PBEPBE/SDD
title: #p freq=noraman PBEPBE/SDD
converged: YES YES NO NO
title: Mulliken charges:
elementType: S S O N N N C C C C C C C C C C H H H H H H H H H H H
charge: 0.222019 0.128663 -0.196413 -0.022285 -0.291471 -0.324726 -0.305496 0.360773 -0.175444 -0.275628 -0.334984 -0.242432 -0.211714 -0.597319 -0.001945 -0.615273 0.244043 0.255315 0.229969 0.230243 0.335675 0.346709 0.253412 0.292162 0.253066 0.225059 0.218022
chargesum: 0.00000
title: Mulliken charges with hydrogens summed into heavy atoms:
elementType: S S O N N N C C C C C C C C C C
charge: 0.222019 0.128663 -0.196413 -0.022285 0.044204 0.021982 -0.305496 0.360773 -0.175444 -0.031584 -0.079669 -0.012463 0.018529 -0.051745 -0.001945 0.080873
polarizability: 2.38552508e+02 1.04845162e+01 1.66681864e+02 1.71089469e+01 -1.35698445e+01 1.10132816e+02
1716.lowfreq: -5.0792 -0.0010 0.0014 0.0021 3.6571 6.9394 15.2413 29.2497 38.9373
frequency: 15.1398 29.2356 38.9331 46.4974 60.9397 103.9456 162.1104 178.8559 184.6468 228.9107 238.5068 271.5309 311.3658 321.5197 355.1396 377.3775 430.8002 438.7084 445.3249 465.9468 483.2555 514.2812 547.5614 586.4830 608.4986 620.5748 626.8922 672.4408 728.5224 754.4307 757.9452 761.4380 836.1413 860.0850 885.4333 940.5853 980.4647 980.9753 1013.7067 1034.0979 1037.9708 1064.7126 1070.1518 1105.3862 1124.4607 1169.0697 1236.6386 1255.0738 1258.8804 1283.6417 1292.3774 1374.4298 1392.8530 1433.1496 1434.9325 1445.5149 1450.0042 1464.8347 1478.3629 1485.9573 1564.0427 1578.5578 1619.4840 1652.5132 2984.0382 3034.8743 3078.1656 3094.3197 3120.4047 3136.0451 3149.8483 3164.6418 3175.3431 3528.4047 3560.2752
redmass: 4.4502 4.9970 6.1633 3.7762 5.8712 5.6145 3.3529 3.5013 3.9546 3.6546 2.0665 2.0518 3.6947 2.5970 4.7090 2.3009 3.3337 8.0822 7.7907 3.1214 9.2163 2.6775 3.1733 6.5223 5.3673 7.4548 6.4682 7.0258 2.7959 4.1480 1.3113 1.5047 8.5590 1.3805 7.6389 1.3816 1.7420 1.3151 2.8986 3.1562 4.0851 1.5200 2.3849 2.8156 1.8240 1.0954 3.0150 1.1908 2.2464 1.2028 2.5096 4.4769 1.2049 1.0937 2.9002 2.7203 1.3694 1.0403 1.0467 1.3018 7.0921 7.5911 8.4710 7.8953 1.0375 1.0592 1.0956 1.1024 1.1058 1.0855 1.0905 1.0955 1.0997 1.0794 1.0783
irintensity: 0.1023 0.5126 0.5258 1.4453 6.5545 1.2306 1.9772 2.2478 2.4015 2.2040 8.8348 17.1287 6.5341 9.9414 7.3181 29.2336 15.8568 7.7549 43.4686 81.2728 1.0511 96.7118 29.4984 2.3791 18.0843 4.7879 2.3709 7.0597 15.0870 3.5377 7.0071 91.8095 67.8260 1.1767 12.7927 3.0752 43.7528 0.3209 13.2600 3.1699 78.6408 4.1455 7.9231 319.9617 64.9264 1.0859 14.0016 4.5310 2.6828 10.7651 7.7838 2.4670 15.0662 19.1524 21.9649 39.5807 137.9894 18.1068 7.1826 52.9127 161.6847 142.7620 159.3557 135.4274 26.0320 18.5959 31.2078 6.8824 14.7155 1.8701 9.5336 17.8433 16.0201 38.6303 94.6107
temp: 298.150 k
press: 1.00000 atm
elementType: 16 16 8 7 7 7 6 6 6 6 6 6 6 6 6 6 1 1 1 1 1 1 1 1 1 1 1
symmnumber: 1
zpe: 521563.5 jmol-1
zpe.correction: 0.198653 hartree
zpe.thermalcorrener: 0.214784 hartree
zpe.thermalcorrenthalpy: 0.215728 hartree
zpe.thermalcorrgfe: 0.151811 hartree
zpe.sumelectzpe: -1422.089175 hartree
zpe.sumelectthermal: -1422.073044 hartree
zpe.sumelectthermalent: -1422.072100 hartree
zpe.sumelectthermalfe: -1422.136016 hartree
dipole: 0.0527 -0.1924 -0.6348
dipole: 0.6654
quadrupole: -93.1997 -98.4394 -111.8540
quadrupole: -0.9009 2.2351 0.9478
quadrupole: 7.9647 2.7250 -10.6897 -0.9009 2.2351 0.9478
hfenergy: -1422.2878278 hartree
pointgroup: C01 [X(C10H11N3O1S2)]
dipole: 0.0410907 -0.0403506 -0.2553629 debye
polarizability: 234.6609388|9.6652003|169.6242416|28.2093431|-4.3142468|111.0820071 unknown
InChI: InChI=1S/C10H11N3OS2/c1-2-15-10(14)13-12-9-11-7-5-3-4-6-8(7)16-9/h3-6,12-13H,2H2,1H3
charge 0 multiplicity 1
27 atoms
S  1.702168 -2.129674 0.337092
S  -4.322569 -0.011374 -1.260374
O  -2.951491 -1.235564 0.8254
N  0.450301 0.042343 -0.71258
N  -0.821231 -1.992546 -0.868741
N  -1.981448 -1.350042 -1.306502
C  2.545481 -0.512797 0.339518
C  1.708159 0.489188 -0.255182
C  0.283316 -1.239498 -0.483982
C  3.825421 -0.211958 0.836535
C  2.17961 1.819008 -0.345062
C  4.279792 1.124946 0.736345
C  3.463317 2.127473 0.151581
C  -5.301986 0.479195 0.291238
C  -2.959376 -0.949412 -0.393104
C  -4.786654 1.77723 0.923819
H  4.458216 -0.980734 1.290231
H  1.538731 2.581809 -0.796747
H  5.273469 1.383405 1.117156
H  3.834706 3.155688 0.085443
H  -0.937396 -2.944241 -0.51859
H  -1.959567 -0.960599 -2.252256
H  -6.344533 0.557912 -0.058659
H  -5.206907 -0.374807 0.982225
H  -3.743895 1.658389 1.26349
H  -4.830315 2.621026 0.213675
H  -5.405721 2.034638 1.804933
