program: Gaussian 09
title: 000247690
version: EM64L-G09RevD.01
frameworkgroup: C1[X(C8H15NO3S2)]
method: RPBEPBE
basis: SDD
operation: Freq
keyword: #p
keyword: freq=noraman
keyword: PBEPBE/SDD
title: #p freq=noraman PBEPBE/SDD
converged: YES YES NO NO
title: Mulliken charges:
elementType: S S O O O N C C C C C C C C H H H H H H H H H H H H H H H
charge: 0.113501 0.236534 -0.225104 -0.246616 -0.250813 -0.355551 -0.363996 -0.305988 -0.018518 -0.601971 -0.610188 -0.617984 0.026654 -0.619239 0.264013 0.247309 0.236036 0.242432 0.377140 0.249676 0.293344 0.285472 0.258780 0.244180 0.222355 0.214104 0.253162 0.227776 0.223497
chargesum: 0.00000
title: Mulliken charges with hydrogens summed into heavy atoms:
elementType: S S O O O N C C C C C C C C
charge: 0.113501 0.236534 -0.225104 -0.246616 -0.250813 0.021589 0.147326 0.172481 -0.018518 -0.058951 -0.065936 0.062655 0.026654 0.085196
polarizability: 1.95555522e+02 1.15241816e-01 1.49148029e+02 8.85669566e+00 3.35198376e+00 8.98495453e+01
1716.lowfreq: -2.1010 -0.0011 0.0011 0.0019 1.1722 4.5928 19.0315 29.3065 35.0155
frequency: 18.9029 29.1688 34.9907 40.5079 51.7568 71.3530 88.8092 94.2779 116.4268 154.0789 160.3842 218.1471 224.3012 254.7637 271.8191 275.9269 310.6204 323.3394 363.5085 398.2808 439.2596 461.8853 482.5748 601.1780 612.6072 616.3181 623.9981 727.3947 747.8415 754.8412 757.3900 761.0350 841.4148 892.2035 982.6818 982.8982 999.9511 1058.9816 1060.9475 1064.8674 1069.0030 1070.0197 1088.3673 1093.1262 1191.7440 1221.2070 1253.2452 1255.6316 1273.6491 1281.5152 1287.6288 1345.2312 1359.4291 1389.2099 1395.2672 1432.0686 1433.9678 1443.2023 1464.0689 1464.3264 1466.0851 1478.0841 1480.0540 1481.0762 1594.4142 1641.9897 2980.4830 2982.3806 2987.6469 3029.9710 3034.1880 3037.8908 3058.7447 3074.1614 3080.8704 3089.2034 3096.7151 3115.7602 3123.0263 3124.7224 3446.7144
redmass: 4.4717 3.3185 4.2933 3.5329 4.6757 4.1746 6.9171 5.5753 3.9936 2.4534 2.4148 2.0782 1.7089 2.5195 2.0041 2.2375 4.0063 3.2238 4.4346 3.6637 7.2967 3.5044 6.3230 5.3394 6.7274 8.5269 9.3839 3.3499 1.2166 2.0963 1.5338 1.2628 6.3544 2.7079 1.7367 1.7588 2.3527 1.3827 1.4012 2.7478 2.4153 2.3946 4.6931 3.4494 2.0402 1.2284 1.1846 1.1943 1.1729 1.2239 1.1991 1.2678 1.3152 1.2096 1.2043 1.1070 1.0926 1.0959 1.0818 1.0433 1.0424 1.0485 1.2173 1.3504 6.5849 8.3814 1.0375 1.0656 1.0370 1.0592 1.0618 1.0595 1.0952 1.0958 1.0965 1.1020 1.1018 1.1056 1.1060 1.1058 1.0802
irintensity: 0.0660 0.1970 1.1177 0.2638 0.1977 1.7262 5.1827 5.0814 0.2628 1.6277 6.2509 5.1617 2.3906 6.0940 10.3205 8.7535 23.6841 1.4964 16.4722 4.4731 1.6736 3.4838 4.8741 8.9651 3.6492 15.4724 19.7165 71.8502 94.6189 29.5911 1.4186 4.2550 20.4012 7.4884 51.3736 54.6346 51.5227 1.2635 31.2574 54.2123 60.2239 48.3301 433.0208 116.7512 148.9933 39.1940 1.9358 11.1226 118.2429 10.5218 3.0365 13.5892 0.5136 16.3990 20.4727 18.6326 19.0547 16.7606 30.4746 8.8618 21.3953 5.8784 168.7751 416.9636 104.0500 200.6166 42.7544 31.8682 25.0391 19.8861 19.1797 14.4652 10.5175 37.1365 25.4159 8.4057 6.6946 16.5376 16.0060 12.8961 331.9021
temp: 298.150 k
press: 1.00000 atm
elementType: 16 16 8 8 8 7 6 6 6 6 6 6 6 6 1 1 1 1 1 1 1 1 1 1 1 1 1 1 1
symmnumber: 1
zpe: 599255.7 jmol-1
zpe.correction: 0.228244 hartree
zpe.thermalcorrener: 0.246037 hartree
zpe.thermalcorrenthalpy: 0.246982 hartree
zpe.thermalcorrgfe: 0.178577 hartree
zpe.sumelectzpe: -1389.296741 hartree
zpe.sumelectthermal: -1389.278948 hartree
zpe.sumelectthermalent: -1389.278004 hartree
zpe.sumelectthermalfe: -1389.346409 hartree
dipole: -2.3847 -0.7741 0.8415
dipole: 2.6447
quadrupole: -95.6368 -95.6517 -98.5019
quadrupole: 2.5734 2.9325 3.2713
quadrupole: 0.9600 0.9450 -1.9051 2.5734 2.9325 3.2713
hfenergy: -1389.5249858 hartree
pointgroup: C01 [X(C8H15N1O3S2)]
dipole: -0.9871364 -0.1461809 0.2946723 debye
polarizability: 193.1780847|-1.8205007|148.2997793|17.2478358|-9.0613983|93.0752325 unknown
InChI: InChI=1S/C8H15NO3S2/c1-3-13-7(10)9-5-6-12-8(11)14-4-2/h9H,3-6H2,1-2H3
charge 0 multiplicity 1
29 atoms
S  2.573508 -1.736816 -0.064327
S  -4.223802 0.46361 -0.908148
O  -2.081212 1.862145 -0.347231
O  3.1914 0.929392 -0.541597
O  -1.7581 -0.445353 -0.080437
N  0.920557 0.370227 -0.464134
C  0.437468 1.730002 -0.743092
C  -0.706565 2.171708 0.184832
C  2.263399 0.088316 -0.39727
C  4.459432 -1.649269 0.102837
C  -4.449115 -1.425869 -0.817306
C  4.9131 -1.397533 1.5464
C  -2.480608 0.538502 -0.372018
C  -4.711139 -1.919937 0.609721
H  1.298535 2.408613 -0.604307
H  0.10929 1.836018 -1.7969
H  -0.744362 3.268762 0.260861
H  -0.603402 1.720895 1.188013
H  0.208674 -0.35399 -0.30397
H  4.821939 -2.611751 -0.294546
H  4.772737 -0.829501 -0.565436
H  -3.533155 -1.866965 -1.241868
H  -5.296721 -1.619897 -1.495888
H  4.544299 -0.420517 1.902811
H  4.545242 -2.181479 2.231287
H  6.019292 -1.385339 1.597973
H  -3.845157 -1.712607 1.260481
H  -5.605547 -1.442974 1.046427
H  -4.874785 -3.014393 0.600333
