program: Gaussian 09
title: 000247686
version: EM64L-G09RevD.01
frameworkgroup: C1[X(C10H18N2O2S2)]
method: RPBEPBE
basis: SDD
operation: Freq
keyword: #p
keyword: freq=noraman
keyword: PBEPBE/SDD
title: #p freq=noraman PBEPBE/SDD
converged: YES YES NO NO
title: Mulliken charges:
elementType: S S O O N N C C C C C C C C C C H H H H H H H H H H H H H H H H H H
charge: 0.094494 0.094497 -0.244820 -0.244816 -0.096416 -0.096430 -0.365865 -0.379704 -0.365839 -0.379677 -0.020339 -0.020330 -0.587305 -0.587313 -0.620008 -0.620005 0.249745 0.236761 0.234932 0.266860 0.249747 0.236771 0.234938 0.266860 0.249308 0.294861 0.249306 0.294863 0.247923 0.222055 0.217487 0.247913 0.222058 0.217490
chargesum: 0.00000
title: Mulliken charges with hydrogens summed into heavy atoms:
elementType: S S O O N N C C C C C C C C C C
charge: 0.094494 0.094497 -0.244820 -0.244816 -0.096416 -0.096430 0.120642 0.122088 0.120679 0.122120 -0.020339 -0.020330 -0.043137 -0.043145 0.067457 0.067455
polarizability: 2.59685381e+02 6.82052031e-04 1.50963393e+02 1.03008285e+01 -9.40775192e-04 1.07242460e+02
1716.lowfreq: -0.0026 -0.0024 -0.0018 5.9159 6.1013 17.7613 26.6359 34.7133 41.1023
frequency: 22.7374 34.6919 40.6788 42.5078 60.4823 63.2773 75.6011 92.1447 102.5234 166.4851 191.7619 220.6692 227.3255 262.5369 272.4265 292.5331 317.4024 329.7902 332.8257 372.6651 395.3615 405.7596 427.2996 462.4760 474.9453 568.4937 607.4560 609.7096 617.5836 619.8059 643.9514 657.6587 754.5487 754.9021 814.7344 836.1162 871.2221 964.3594 982.0905 983.3643 995.4062 1030.3238 1044.8450 1060.2390 1060.6003 1071.0829 1071.0872 1081.8734 1158.9333 1176.5403 1204.6319 1205.8214 1222.2960 1255.2830 1255.3505 1279.6434 1284.1997 1285.5064 1334.1921 1347.7394 1352.9866 1361.5187 1385.8016 1391.1793 1391.3034 1394.8983 1430.1450 1430.6476 1456.3963 1458.0085 1465.0043 1465.7132 1465.9560 1467.3062 1478.1637 1478.1805 1617.0457 1618.0590 2980.4058 2982.4986 2982.6060 2983.0088 2990.8275 2994.7278 3033.5921 3033.6230 3076.1168 3076.1399 3086.1846 3088.2421 3092.8092 3092.8194 3097.0697 3098.9162 3119.3178 3119.3304
redmass: 4.0919 2.8105 2.6438 4.2600 4.8373 9.0044 4.2631 5.3672 5.3139 2.1545 1.6031 3.8708 1.9879 1.4434 1.8603 2.6658 2.8301 3.0835 3.6457 5.1303 3.4819 3.0715 6.6360 3.0789 7.1384 3.1245 8.2811 7.0454 6.4558 6.9567 6.2403 2.5850 1.1884 1.1866 4.6378 1.5868 4.4394 2.5149 1.7955 1.7349 2.4215 2.5178 1.8018 1.3244 1.3366 2.3211 2.3213 2.3149 3.8182 1.6952 1.7739 1.2054 4.0707 1.1985 1.1950 1.4798 1.2005 1.2060 1.2643 1.2643 1.4344 1.3980 2.0969 1.2088 1.2141 2.1127 1.1005 1.1018 1.0762 1.0906 1.0816 1.0425 1.0496 1.0935 1.0461 1.0461 9.0964 9.4534 1.0685 1.0469 1.0372 1.0586 1.0648 1.0654 1.0593 1.0593 1.0959 1.0959 1.0937 1.0996 1.1017 1.1018 1.0938 1.0993 1.1059 1.1059
irintensity: 0.3256 0.0133 0.1604 0.0044 7.9735 0.0114 0.2699 0.0593 3.6847 1.0489 5.5507 5.4645 5.8927 1.2851 5.5319 11.6493 6.4270 3.3347 9.1834 32.2572 6.4092 2.9829 2.1894 0.0294 1.2997 24.5888 0.0005 33.9769 0.0837 12.5013 9.0077 29.2234 7.3533 1.2335 33.8147 1.0766 97.5938 4.7269 171.1433 0.0600 139.4544 11.3807 5.3018 2.2637 0.2186 6.6054 6.1655 15.3384 23.6999 451.8931 80.9810 35.4569 67.3695 4.0767 0.3380 55.2716 10.8932 8.7085 0.5033 0.0084 16.6682 1.3129 66.0676 37.5063 0.0181 174.3123 74.9484 2.8760 21.0909 5.4733 14.6319 29.3096 15.5391 4.5722 7.4845 7.0602 434.4765 204.4078 23.4696 1.1832 69.5440 3.9858 12.5781 96.7896 35.1101 4.2321 62.9064 7.1174 4.8448 16.7158 7.0239 11.6190 4.0155 5.7640 6.1963 22.4277
temp: 298.150 k
press: 1.00000 atm
elementType: 16 16 8 8 7 7 6 6 6 6 6 6 6 6 6 6 1 1 1 1 1 1 1 1 1 1 1 1 1 1 1 1 1 1
symmnumber: 1
zpe: 726342.9 jmol-1
zpe.correction: 0.276649 hartree
zpe.thermalcorrener: 0.295410 hartree
zpe.thermalcorrenthalpy: 0.296354 hartree
zpe.thermalcorrgfe: 0.226768 hartree
zpe.sumelectzpe: -1446.696782 hartree
zpe.sumelectthermal: -1446.678022 hartree
zpe.sumelectthermalent: -1446.677078 hartree
zpe.sumelectthermalfe: -1446.746664 hartree
dipole: 0.0001 -1.8343 0.0016
dipole: 1.8343
quadrupole: -107.4791 -116.6929 -111.8058
quadrupole: -0.0010 5.1157 0.0014
quadrupole: 4.5135 -4.7003 0.1868 -0.0010 5.1157 0.0014
hfenergy: -1446.9734319 hartree
pointgroup: C01 [X(C10H18N2O2S2)]
dipole: -0.0000121 0.7216582 -0.0009316 debye
polarizability: 260.3768788|0.0143304|150.9633852|-0.4632877|-0.0205454|106.5509694 unknown
InChI: InChI=1S/C10H18N2O2S2/c1-3-15-9(13)11-5-7-12(8-6-11)10(14)16-4-2/h3-8H2,1-2H3
charge 0 multiplicity 1
34 atoms
S  -3.559542 1.471221 -0.700253
S  3.559137 1.472811 0.699588
O  -3.321556 -1.279747 -0.613968
O  3.3219 -1.278314 0.616049
N  -1.298407 -0.115458 -0.584354
N  1.298475 -0.114549 0.584231
C  -0.5011 1.125856 -0.591041
C  -0.495917 -1.36303 -0.589415
C  0.50093 1.126618 0.58955
C  0.496279 -1.362311 0.590586
C  -2.677973 -0.195878 -0.623157
C  2.678046 -0.194594 0.623724
C  -5.334774 0.813469 -0.577179
C  5.334563 0.815515 0.576919
C  -5.803098 0.653128 0.874164
C  5.802719 0.653905 -0.874338
H  -1.163224 2.002297 -0.507537
H  0.056552 1.199512 -1.546022
H  0.060193 -1.434191 -1.545237
H  -1.190367 -2.214931 -0.516641
H  1.162904 2.003075 0.504999
H  -0.056721 1.201295 1.544455
H  -0.059817 -1.432653 1.546483
H  1.190944 -2.214111 0.518693
H  -5.935204 1.546771 -1.140924
H  -5.329284 -0.15254 -1.108116
H  5.934837 1.549563 1.139861
H  5.329453 -0.149973 1.108808
H  -5.189282 -0.099715 1.397069
H  -5.742396 1.605511 1.429104
H  -6.85525 0.30874 0.893411
H  5.189031 -0.099601 -1.396441
H  5.741687 1.605739 -1.43018
H  6.854959 0.309771 -0.893397
