program: Gaussian 09
title: 000247679
version: EM64L-G09RevD.01
frameworkgroup: C1[X(C12H16N4O)]
method: RPBEPBE
basis: SDD
operation: Freq
keyword: #p
keyword: freq=noraman
keyword: PBEPBE/SDD
title: #p freq=noraman PBEPBE/SDD
converged: NO YES NO NO
title: Mulliken charges:
elementType: O N N N N C C C C C C C C C C C C H H H H H H H H H H H H H H H H
charge: -0.201168 -0.175922 -0.033575 -0.362374 -0.004133 -0.067941 -0.417379 -0.380632 -0.365616 -0.414570 -0.390322 -0.410429 0.309766 -0.239632 -0.127763 0.031945 -0.236776 0.168628 0.219202 0.218588 0.204653 0.221453 0.192171 0.207499 0.218030 0.190309 0.209295 0.196043 0.211204 0.207232 0.273753 0.311802 0.236658
chargesum: 0.00000
title: Mulliken charges with hydrogens summed into heavy atoms:
elementType: O N N N N C C C C C C C C C C C C
charge: -0.201168 -0.175922 -0.033575 -0.050572 -0.004133 0.100687 0.020411 0.045473 0.034055 -0.006230 0.015016 0.008006 0.309766 0.034121 -0.127763 0.031945 -0.000118
polarizability: 2.15532701e+02 -2.02728425e+00 1.48796596e+02 8.14391222e-01 -6.07849642e-01 1.03320254e+02
1716.lowfreq: -17.8188 -5.3366 0.0007 0.0007 0.0008 3.0663 19.4650 52.1041 55.4012
frequency: -13.6875 51.9807 55.0119 112.5871 119.3631 146.2093 175.4776 201.4628 246.0982 264.3700 280.6838 321.3619 351.3463 378.8812 400.0674 449.7789 484.8507 487.5827 510.0541 534.9387 568.7200 592.9332 640.8481 659.7557 674.1138 717.4648 744.3765 764.9550 770.8918 789.5211 829.0518 842.0496 860.1002 869.2140 884.6526 920.9235 933.4833 947.0930 1008.7048 1017.1853 1020.0203 1034.0017 1071.0816 1075.9331 1123.6400 1140.9243 1149.3018 1175.8847 1180.5877 1203.6767 1208.5896 1249.2159 1262.8743 1277.2629 1284.2051 1312.2293 1320.7810 1327.0812 1331.3540 1332.9986 1340.4636 1344.2531 1358.2234 1361.1100 1364.1554 1384.1775 1419.9860 1460.6768 1464.1215 1466.4333 1469.5633 1481.2566 1484.1107 1507.7895 1534.0357 1596.7308 1635.7492 2952.5497 2965.2664 2971.1900 2974.1336 2977.2533 2982.5509 2989.5107 3018.3163 3029.2724 3036.3326 3037.8180 3045.7358 3051.2180 3116.8123 3238.6306 3533.1429
redmass: 3.9482 3.6597 5.5934 6.2114 2.0934 3.1083 6.0851 3.5349 3.0205 3.0883 2.1467 4.4142 3.4909 3.7207 4.3012 1.7828 10.2982 2.9438 1.9625 1.3009 5.9523 7.2775 3.5242 12.2564 6.4612 1.6272 2.7233 2.5922 2.1246 2.5209 1.5464 2.6601 7.0794 2.1039 1.4596 3.3515 3.4274 2.1719 2.2153 2.3772 1.5297 2.0768 2.2214 3.0650 2.6093 2.5964 2.2688 1.6434 1.6362 1.6575 1.2941 1.1974 2.1585 1.2162 1.2350 1.3161 2.5234 1.5335 1.4650 3.6483 1.4595 1.3530 1.4178 1.3943 1.3996 1.4103 3.6608 1.0868 1.0830 1.0845 1.0820 1.0871 1.0849 4.2019 8.8301 6.4074 12.4302 1.0831 1.0645 1.0624 1.0612 1.0621 1.0654 1.0618 1.0974 1.0983 1.0960 1.1029 1.1009 1.1025 1.0924 1.0981 1.0790
irintensity: 0.0850 3.1856 5.7633 1.8086 0.8719 1.0485 0.1170 0.6008 1.6112 3.0994 0.4437 1.5243 0.4463 0.6912 1.3039 0.9867 1.7130 31.7826 1.2268 69.7491 2.5721 0.6377 5.3886 6.7756 25.1015 1.5412 8.8235 20.1109 3.4206 3.0902 6.9076 1.6879 7.2428 4.4706 11.6945 44.8587 19.6590 5.1058 13.4788 1.9136 2.8028 3.0538 0.4745 34.3982 15.8873 7.6799 1.4883 22.7070 5.8370 29.0069 7.9492 0.5365 0.3262 0.8151 5.3074 1.0986 23.7031 16.8321 4.4683 15.4218 8.5094 2.2478 9.8574 4.0888 0.8534 5.0229 10.1570 9.2410 12.4408 0.2648 5.6155 13.6773 18.7675 13.7995 375.0364 72.0403 406.2528 15.2207 20.9372 16.5400 44.4111 13.8344 39.2772 24.2513 14.3865 69.6843 49.6035 17.2544 59.2077 68.2240 22.7963 0.3275 21.7975
temp: 298.150 k
press: 1.00000 atm
elementType: 8 7 7 7 7 6 6 6 6 6 6 6 6 6 6 6 6 1 1 1 1 1 1 1 1 1 1 1 1 1 1 1 1
symmnumber: 1
zpe: 713466.9 jmol-1
zpe.correction: 0.271745 hartree
zpe.thermalcorrener: 0.285587 hartree
zpe.thermalcorrenthalpy: 0.286531 hartree
zpe.thermalcorrgfe: 0.231094 hartree
zpe.sumelectzpe: -759.825805 hartree
zpe.sumelectthermal: -759.811963 hartree
zpe.sumelectthermalent: -759.811019 hartree
zpe.sumelectthermalfe: -759.866456 hartree
dipole: -12.2711 5.3797 -0.1286
dipole: 13.3992
quadrupole: -144.5989 -97.7644 -99.5419
quadrupole: 14.5841 -0.2045 0.0547
quadrupole: -30.6305 16.2040 14.4265 14.5841 -0.2045 0.0547
hfenergy: -760.09755 hartree
pointgroup: C01 [X(C12H16N4O1)]
dipole: 4.8345586 2.0794141 -0.305332 debye
polarizability: 215.5181433|2.1258544|147.3424162|1.576648|-7.9853557|104.7889923 unknown
InChI: InChI=1S/C12H16N4O/c17-12-10-11(13-7-14-12)16(8-15-10)9-5-3-1-2-4-6-9/h7-9,13H,1-6H2
charge 0 multiplicity 1
33 atoms
O  -4.663682 -0.994265 0.13263
N  -0.00902 -0.362562 0.096763
N  -1.684786 -1.913458 0.33818
N  -1.466818 1.643048 -0.294023
N  -3.842818 1.188944 -0.247946
C  1.366691 0.203507 0.005578
C  2.02401 -0.249523 -1.325244
C  2.167155 -0.118033 1.297834
C  3.470433 0.252086 -1.558626
C  3.432432 0.764117 1.456318
C  4.520129 -0.418692 -0.634446
C  4.718577 0.25077 0.752392
C  -1.217443 0.302845 -0.049266
C  -0.360284 -1.712816 0.329676
C  -2.25208 -0.646097 0.102733
C  -3.663478 -0.243958 0.010882
C  -2.826723 2.005756 -0.378794
H  1.251272 1.308806 -0.026505
H  1.373083 0.085607 -2.156493
H  2.025072 -1.357372 -1.35762
H  2.43773 -1.191554 1.324314
H  1.491753 0.059215 2.156278
H  3.520678 1.356362 -1.462114
H  3.72701 0.026348 -2.61149
H  3.654099 0.877454 2.534565
H  3.191773 1.785067 1.093854
H  5.501898 -0.439393 -1.145722
H  4.230186 -1.480716 -0.500413
H  5.229947 -0.475952 1.413842
H  5.411729 1.108454 0.645224
H  0.390573 -2.483038 0.485132
H  -0.729989 2.341635 -0.407754
H  -2.999914 3.072204 -0.572943
