program: Gaussian 09
title: 000247669
version: EM64L-G09RevD.01
frameworkgroup: C1[X(C10H10N2)]
method: RPBEPBE
basis: SDD
operation: Freq
keyword: #pfreq=noraman
keyword: PBEPBE/SDD
title: #p freq=noraman PBEPBE/SDD
converged: NO NO NO NO
title: Mulliken charges:
elementType: N N C C C C C C C C C C H H H H H H H H H H
charge: -0.007431 -0.007430 0.376653 0.376652 0.069207 0.069205 -0.536640 -0.536638 -0.810701 -0.810701 -0.291296 -0.291297 0.263829 0.263829 0.239624 0.228577 0.228733 0.228769 0.239623 0.228542 0.239446 0.239446
chargesum: 0.00000
title: Mulliken charges with hydrogens summed into heavy atoms:
elementType: N N C C C C C C C C C C
charge: -0.007431 -0.007430 0.376653 0.376652 0.069207 0.069205 -0.272811 -0.272809 -0.113768 -0.113767 -0.051851 -0.051851
polarizability: 1.97639620e+02 -2.62188969e-05 1.17827260e+02 3.14771699e-03 -1.28648423e-02 5.66377495e+01
1716.lowfreq: -4.6700 -0.0005 0.0001 0.0005 11.7906 19.7957 107.4099 121.3688 138.6179
frequency: 107.3850 121.3454 138.5983 201.0741 246.1113 273.3115 296.8911 312.3509 404.9525 432.5540 446.4132 494.9743 538.4393 544.0744 593.3817 675.8369 678.5347 723.0585 804.4309 806.0858 849.1215 905.8065 908.9823 916.6733 950.0250 1001.5496 1014.7233 1021.7270 1037.0139 1054.4513 1086.4594 1166.2773 1191.5634 1246.9010 1257.0956 1305.7081 1338.5571 1378.6556 1397.7487 1408.2863 1425.5437 1426.3718 1462.1202 1470.8065 1477.0756 1478.0598 1489.3456 1523.4953 1535.0328 1634.7637 2970.3721 2970.6116 3041.9992 3043.2561 3084.9878 3087.5684 3120.7807 3145.0289 3145.8907 3149.0076
redmass: 3.6677 3.4254 1.0716 1.0795 3.1971 3.6229 2.5186 3.8480 5.1301 3.5291 6.1945 5.0014 3.3290 3.1383 9.4985 5.6796 3.2402 6.0896 3.3509 3.4288 1.1852 1.3708 1.5802 6.2022 1.4917 1.4527 1.5895 2.4406 1.4568 1.6552 3.9385 1.6582 4.0868 1.2986 5.0625 2.8886 1.9164 3.4840 1.2339 1.2552 2.5576 2.3394 1.0468 1.2671 1.4655 1.0451 2.9949 6.7422 4.9084 6.9207 1.0387 1.0378 1.0966 1.0965 1.0986 1.0979 1.0882 1.0971 1.0920 1.0924
irintensity: 0.0000 5.1845 0.0000 0.1056 0.0000 2.2063 0.3615 0.6884 3.7861 18.5540 0.3364 0.2895 0.0151 0.0000 1.1988 0.1969 0.0000 1.7424 1.9370 0.0000 5.2155 52.7710 0.0000 8.1981 0.0000 13.4009 0.2773 20.8139 20.8978 0.0008 0.2480 1.3255 5.7209 0.1992 11.2602 2.5841 5.9326 11.4814 8.7149 17.0629 1.8741 4.4012 0.0007 24.1012 11.1198 33.9019 70.1921 0.4598 3.8858 5.3764 6.1625 54.5501 38.3549 0.0009 35.9828 1.6804 3.7470 56.4774 11.0374 0.4098
temp: 298.150 k
press: 1.00000 atm
elementType: 7 7 6 6 6 6 6 6 6 6 6 6 1 1 1 1 1 1 1 1 1 1
symmnumber: 1
zpe: 460318.5 jmol-1
zpe.correction: 0.175326 hartree
zpe.thermalcorrener: 0.185324 hartree
zpe.thermalcorrenthalpy: 0.186269 hartree
zpe.thermalcorrgfe: 0.140295 hartree
zpe.sumelectzpe: -495.722075 hartree
zpe.sumelectthermal: -495.712077 hartree
zpe.sumelectthermalent: -495.711133 hartree
zpe.sumelectthermalfe: -495.757107 hartree
dipole: 2.1995 0.0000 0.0005
dipole: 2.1995
quadrupole: -56.0373 -73.7439 -72.9645
quadrupole: 0.0000 0.0011 -0.0019
quadrupole: 11.5446 -6.1620 -5.3826 0.0000 0.0011 -0.0019
hfenergy: -495.8974015 hartree
pointgroup: C01 [X(C10H10N2)]
dipole: -0.8653582 0. -0.0001867 debye
dipolederiv: -0.058485 0.0258223 0.0000269 0.0497471 -0.2226769 0.0000057 0.0000081 0.0000006 -0.2651293 -0.0584853 -0.0258228 -0.0000245 -0.0497478 -0.2226765 0.0000092 -0.0000017 0.0000162 -0.2651289 0.3008362 -0.2264485 -0.0001273 -0.386969 0.0585802 0.0000135 -0.0007372 0.0001605 -0.0444525 0.3008379 0.2264487 0.0002526 0.3869692 0.0585785 0.0000946 0.0011252 0.0003038 -0.0444531 0.1336513 0.0422248 -0.0000654 -0.5240593 -0.0841315 -0.0000263 0.0000078 -0.0000277 0.108671 0.1336526 -0.042226 0.0000517 0.5240585 -0.0841332 -0.0000231 -0.000041 -0.0000319 0.1086705 -0.2308287 0.0483537 0.0000536 -0.0100171 0.0861942 0.0000773 0.0000312 0.000019 -0.1694003 -0.2308287 -0.0483526 -0.0000768 0.0100185 0.0861948 0.0000869 -0.0000819 0.000007 -0.1694 -0.1874604 0.1046776 0.0000701 0.041764 0.0376241 -0.0001043 0.0007206 -0.0003684 0.0643223 -0.1874589 -0.1046767 -0.0001433 -0.0417663 0.037623 -0.0001548 -0.0013388 -0.0005003 0.0643213 0.0592394 0.0668829 -0.0000165 0.4809408 0.1164238 0.0000079 0.0000294 0.0000211 -0.0082066 0.0592375 -0.0668827 0.0000037 -0.4809405 0.116426 0.0000035 -0.0000195 0.0000184 -0.0082065 0.0784902 0.003199 -0.0000209 0.0405374 -0.0657609 -0.0000242 -0.0000259 0.0000223 0.1536232 0.07849 -0.0031995 0.0000405 -0.0405379 -0.0657609 -0.0000171 0.0000578 0.0000501 0.1536231 0.0775738 -0.0902421 0.0001722 0.037235 -0.1356189 0.0004784 -0.0001143 0.0004734 0.1118133 -0.0309672 0.0110498 -0.0850779 -0.0024788 0.0785654 -0.0774471 -0.1320076 -0.0320306 -0.0393771 -0.030708 0.0115193 0.0850313 -0.0018776 0.0788745 0.0770023 0.1317907 0.0317177 -0.0401617 -0.0305845 -0.0116807 -0.0849866 0.0016024 0.0789699 0.0768571 -0.1317007 0.0315864 -0.0404428 0.0775734 0.09024 -0.0002871 -0.037236 -0.1356182 0.0007597 0.0002027 0.0007456 0.111812 -0.031091 -0.0108874 0.0851194 0.0027567 0.0784707 -0.0775891 0.1320952 -0.0321599 -0.0390942 -0.1113423 -0.0710966 -0.0000039 -0.0992694 0.0519263 -0.0000043 -0.0000108 -0.0000098 0.1282982 -0.1113421 0.0710975 0.0000083 0.0992703 0.0519256 -0.0000057 0.0000106 -0.0000136 0.1282981 unknown
polarizability: 197.6396203|-0.0001148|117.8272599|0.0031477|0.0128648|56.6377495 unknown
InChI: InChI=1S/C10H10N2/c1-7-5-9-10(6-8(7)2)12-4-3-11-9/h3-6H,1-2H3
charge 0 multiplicity 1
22 atoms
N  1.866676 1.445802 0.000069
N  1.866671 -1.445829 -0.000161
C  -1.787759 0.726914 0.000062
C  -1.787762 -0.726928 -0.000073
C  0.676106 0.723763 0.000026
C  0.676104 -0.723785 -0.000088
C  -0.570544 1.418207 0.000084
C  -0.570549 -1.418225 -0.00011
C  -3.100716 1.485728 0.000264
C  -3.100721 -1.485737 -0.000544
C  3.000342 0.719838 -0.000002
C  3.000339 -0.719869 -0.000126
H  -0.539197 2.513035 0.000152
H  -0.539206 -2.513053 -0.000139
H  -2.931815 2.575752 -0.002017
H  -3.715715 1.235764 -0.886087
H  -3.71333 1.239238 0.889272
H  -3.712455 -1.24026 -0.890455
H  -2.931827 -2.575759 0.003123
H  -3.716594 -1.234762 0.884896
H  3.947778 1.271189 0.000036
H  3.947773 -1.271223 -0.000184
