program: Gaussian 09
title: 000247667
version: EM64L-G09RevD.01
frameworkgroup: C1[X(C9H16O2)]
method: RPBEPBE
basis: SDD
operation: Freq
keyword: #pfreq=noraman
keyword: PBEPBE/SDD
title: #p freq=noraman PBEPBE/SDD
converged: YES YES NO NO
title: Mulliken charges:
elementType: O O C C C C C C C C C H H H H H H H H H H H H H H H H
charge: -0.268337 -0.248687 -0.000344 -0.471387 -0.477194 -0.426780 -0.427138 -0.567168 0.252774 -0.262743 -0.665512 0.237200 0.187513 0.242959 0.222762 0.191909 0.204610 0.218438 0.218564 0.204095 0.242594 0.245153 0.221835 0.233099 0.216481 0.248891 0.226414
chargesum: 0.00000
title: Mulliken charges with hydrogens summed into heavy atoms:
elementType: O O C C C C C C C C C
charge: -0.268337 -0.248687 0.236856 -0.040916 -0.062524 -0.003732 -0.004478 -0.079421 0.252774 0.192191 0.026274
polarizability: 1.27237261e+02 1.50129792e+00 9.04102116e+01 3.59711008e+00 -1.95715419e+00 8.47431677e+01
1716.lowfreq: -40.7117 -14.1526 -11.9395 -0.0003 0.0006 0.0008 4.1370 13.6525 45.1557
frequency: -39.8110 11.6841 44.9928 63.5914 94.3868 115.9103 171.7496 219.7912 275.2017 284.9947 337.6209 405.3834 433.5707 546.7230 586.0095 618.1967 661.7584 757.8036 784.6206 808.4900 817.7714 849.0223 881.0412 891.6925 901.0025 959.4498 971.6635 984.0870 1013.7455 1055.3650 1090.0413 1094.7417 1105.5462 1115.1656 1155.9339 1165.8897 1175.4067 1192.8375 1218.9609 1238.3058 1261.4137 1278.4026 1280.5694 1293.1503 1299.1606 1310.5625 1326.9113 1351.8930 1363.8628 1389.5618 1436.8197 1456.0225 1463.5488 1463.7016 1471.9825 1474.4722 1485.0350 1491.7266 1639.7310 2971.8620 2973.9286 2978.3174 2991.9353 2993.5367 2994.5568 3011.0556 3028.0076 3037.6827 3047.1711 3052.3674 3063.4648 3079.2115 3087.1650 3091.3752 3117.5006
redmass: 1.6322 4.1014 2.9574 3.3892 3.0599 3.7830 2.1549 1.2733 4.5638 2.0281 3.0026 2.5448 2.5034 3.5429 2.6814 2.7232 4.0304 1.3029 1.8989 1.5044 1.8093 2.4442 2.4431 3.2848 2.1931 1.5296 1.5999 1.5168 2.8887 3.1557 2.3685 2.2403 2.4723 1.9715 1.6745 1.6508 1.4944 1.3639 1.3346 1.2935 1.2812 1.1252 1.2750 1.2261 1.3088 1.4065 1.5149 1.3556 1.6247 1.2339 1.0909 1.0943 1.0585 1.0639 1.0847 1.0845 1.0510 1.1002 8.9976 1.0630 1.0692 1.0638 1.0360 1.0755 1.0633 1.0657 1.0594 1.0981 1.0975 1.1002 1.0997 1.1040 1.0975 1.1032 1.1060
irintensity: 0.0381 0.8791 0.3820 0.5876 0.9120 3.4534 0.7151 4.2994 1.7681 5.6920 12.5001 0.6525 2.8769 4.1797 4.5660 0.9814 8.5250 3.3275 9.0597 1.7161 3.4406 2.7050 4.9528 17.0295 0.4028 10.7082 1.9763 3.5371 52.1353 11.9857 43.5641 74.0544 152.5175 3.5604 11.9475 84.6178 6.2167 5.3341 11.1377 4.9648 23.1604 1.6724 12.7312 6.1247 2.2680 3.3660 18.9005 2.2349 19.0334 23.1239 24.0795 11.2379 12.3632 4.2927 9.6034 10.6228 11.9829 3.2264 140.2600 21.3306 20.0726 27.4175 21.2568 33.0852 33.7793 54.9601 31.2709 34.0957 3.9561 18.9723 12.0006 108.3310 36.3189 0.7874 35.2036
temp: 298.150 k
press: 1.00000 atm
elementType: 8 8 6 6 6 6 6 6 6 6 6 1 1 1 1 1 1 1 1 1 1 1 1 1 1 1 1
symmnumber: 1
zpe: 617020.8 jmol-1
zpe.correction: 0.235011 hartree
zpe.thermalcorrener: 0.246591 hartree
zpe.thermalcorrenthalpy: 0.247535 hartree
zpe.thermalcorrgfe: 0.194974 hartree
zpe.sumelectzpe: -502.121973 hartree
zpe.sumelectthermal: -502.110393 hartree
zpe.sumelectthermalent: -502.109449 hartree
zpe.sumelectthermalfe: -502.162009 hartree
dipole: -0.5705 0.9002 -1.0020
dipole: 1.4628
quadrupole: -58.2479 -68.2086 -69.8541
quadrupole: 0.9934 1.2395 2.8992
quadrupole: 7.1890 -2.7717 -4.4173 0.9934 1.2395 2.8992
hfenergy: -502.3569837 hartree
pointgroup: C01 [X(C9H16O2)]
dipole: -0.2047892 -0.2910012 0.4523323 debye
polarizability: 126.9349291|-1.8953828|89.6588639|-4.9508625|-2.6724901|85.7968477 unknown
InChI: InChI=1S/C9H16O2/c1-2-11-9(10)7-8-5-3-4-6-8/h8H,2-7H2,1H3
charge 0 multiplicity 1
27 atoms
O  -2.258831 -0.143282 1.066934
O  -1.371519 0.633671 -0.947332
C  1.288546 -0.314622 -0.109309
C  1.759528 1.079568 0.381659
C  2.514525 -1.211814 0.19941
C  3.258045 1.155785 -0.036504
C  3.742553 -0.331778 -0.172864
C  -0.01571 -0.816613 0.538086
C  -1.242635 -0.026725 0.109933
C  -3.55796 0.526843 0.7478
C  -4.447345 -0.387524 -0.099669
H  1.138519 -0.266204 -1.206646
H  1.665627 1.125566 1.485995
H  1.155703 1.901759 -0.040131
H  2.494448 -2.170551 -0.351211
H  2.527632 -1.451967 1.282135
H  3.855996 1.719351 0.701962
H  3.361105 1.683006 -1.002571
H  4.058871 -0.537301 -1.212199
H  4.610617 -0.547436 0.475538
H  0.05067 -0.802483 1.641642
H  -0.197025 -1.87385 0.252595
H  -3.995854 0.727785 1.738718
H  -3.343915 1.475299 0.224292
H  -5.434533 0.087336 -0.251961
H  -3.995065 -0.564456 -1.089923
H  -4.605093 -1.358166 0.401621
