program: Gaussian 09
title: 000247651
version: EM64L-G09RevD.01
frameworkgroup: C1[X(C11H11NO3)]
method: RPBEPBE
basis: SDD
operation: Freq
keyword: #p
keyword: freq=noraman
keyword: PBEPBE/SDD
title: #p freq=noraman PBEPBE/SDD
converged: NO YES NO NO
title: Mulliken charges:
elementType: O O O N C C C C C C C C C C C H H H H H H H H H H H
charge: -0.257367 -0.417119 -0.248042 -0.475602 0.506074 0.495275 -0.649409 -0.368024 -0.380739 -0.205849 -0.805749 0.232561 -0.298926 -0.213564 0.170263 0.224368 0.311951 0.233146 0.227883 0.310471 0.222476 0.233813 0.234304 0.244626 0.291084 0.382096
chargesum: 0.00000
title: Mulliken charges with hydrogens summed into heavy atoms:
elementType: O O O N C C C C C C C C C C C
charge: -0.257367 -0.035023 -0.248042 -0.165131 0.506074 0.495275 -0.425042 -0.056074 -0.147592 0.022034 -0.115156 0.232561 -0.054300 0.077520 0.170263
polarizability: 2.98322792e+02 -5.49694619e+00 1.37460977e+02 4.58244870e-05 1.13463889e-01 5.91429326e+01
1716.lowfreq: -0.0004 -0.0004 0.0005 5.7299 6.5068 18.2754 35.5634 39.3459 48.6691
frequency: 34.9893 38.8629 48.6485 61.0249 80.4632 152.2207 158.4563 178.6283 214.0420 219.1518 276.9453 283.6289 296.4888 394.0854 443.4878 466.3456 514.7884 554.2600 576.4014 577.8341 605.8916 648.9309 654.1668 701.4614 708.0441 729.6336 787.0527 807.8590 875.5553 889.3920 909.5855 927.5946 936.7502 969.5698 983.2381 995.9151 999.1181 1013.2843 1047.8453 1058.8881 1096.9568 1149.1104 1183.8658 1197.9975 1218.9047 1274.5199 1299.9342 1322.2356 1327.1750 1381.8311 1397.7757 1409.2714 1469.2307 1469.7873 1488.4221 1520.7798 1589.9072 1604.7041 1619.1595 1627.6430 1658.5711 2978.5169 3058.0252 3083.9691 3101.3052 3106.3251 3125.3557 3150.7579 3170.2954 3198.6206 3521.0079 3524.5023
redmass: 1.2575 3.1481 5.9159 6.1913 6.1647 5.4445 5.9522 2.6646 2.9861 6.0601 5.1833 3.5736 9.1295 3.3073 2.8029 4.9823 5.0753 2.4047 1.7076 6.1043 5.8497 1.9730 1.3513 2.0822 6.2255 8.7673 5.9150 1.3922 1.4422 5.0540 2.1766 1.3848 3.4598 2.7238 4.6432 1.0911 1.3144 2.0281 1.5574 2.1389 1.5669 1.8578 1.0932 1.6526 1.4800 2.9361 1.4450 1.5485 2.4993 5.5310 1.3712 2.2163 1.5310 1.0723 1.5676 2.2209 8.9157 3.7216 5.9347 8.5962 6.2010 1.0371 1.0977 1.0989 1.0911 1.0921 1.0877 1.0958 1.0925 1.0952 1.0764 1.0641
irintensity: 0.8652 0.3002 0.0210 0.5573 6.8653 1.7577 4.6844 3.0653 3.1063 0.0544 1.1831 1.8640 3.9819 0.6155 8.9830 59.8122 0.0640 38.2051 44.0835 41.0429 1.8100 108.1261 25.0871 25.2037 0.9355 36.0041 14.1052 61.0669 15.7823 0.3547 2.3832 10.8180 7.1763 7.2931 0.6584 66.2956 0.4789 47.0886 15.0288 419.5486 14.1601 9.1990 0.6614 1.8240 37.8869 0.4361 16.0760 35.7093 177.7615 68.3827 36.4454 22.1385 58.6981 17.1369 64.6533 95.6803 154.5398 26.4210 22.0113 250.1386 98.4716 36.0905 19.2624 15.7440 17.6638 3.6452 8.1935 26.7340 2.1305 7.2320 18.8033 61.7869
temp: 298.150 k
press: 1.00000 atm
elementType: 8 8 8 7 6 6 6 6 6 6 6 6 6 6 6 1 1 1 1 1 1 1 1 1 1 1
symmnumber: 1
zpe: 521254.8 jmol-1
zpe.correction: 0.198535 hartree
zpe.thermalcorrener: 0.212963 hartree
zpe.thermalcorrenthalpy: 0.213907 hartree
zpe.thermalcorrgfe: 0.155124 hartree
zpe.sumelectzpe: -705.124641 hartree
zpe.sumelectthermal: -705.110214 hartree
zpe.sumelectthermalent: -705.109270 hartree
zpe.sumelectthermalfe: -705.168052 hartree
dipole: -2.0046 2.4620 -0.0024
dipole: 3.1749
quadrupole: -68.0522 -89.8152 -91.1924
quadrupole: -3.8322 -0.0276 0.0098
quadrupole: 14.9677 -6.7953 -8.1724 -3.8322 -0.0276 0.0098
hfenergy: -705.3231768 hartree
pointgroup: C01[X(C11H11N1O3)]
dipole: -0.786 0.970608 -0.0190622 debye
dipolederiv: -0.6322992 -0.0472608 0.002501 0.4717984 -0.833159 0.0090247 -0.0078025 0.0103107 -0.3471274 -1.3894997 0.5224506 -0.0036979 0.5398499 -0.5305817 -0.002199 -0.0033324 -0.002042 -0.4305546 -0.87421 -0.13833 0.006345 -0.3461892 -0.9464937 0.0140684 0.011039 0.0128524 -0.331439 -1.2327288 0.2383612 -0.0011371 0.2665024 -0.3599347 -0.0001859 -0.0005075 -0.0008189 -0.3124708 0.7209936 0.029735 -0.0027117 0.1908256 0.0946855 -0.0004649 -0.0063357 0.0001368 0.116382 0.1971834 -0.1785736 0.0034169 -0.4397373 0.2210391 -0.0029943 0.0065058 -0.0021696 -0.0060707 -0.2096289 0.1070554 -0.0022133 0.0136226 -0.0087009 -0.0042574 0.0000384 -0.0050384 -0.2266286 -0.2022129 -0.022366 0.0009771 0.0219426 -0.1302462 -0.0014182 0.000227 -0.0009144 -0.1775141 -0.0717037 0.0703063 -0.0019827 0.2013769 -0.1904551 -0.0008052 -0.0051796 -0.0006096 -0.1986641 0.0224446 0.0359424 -0.0008638 0.1424148 0.1618096 -0.0069582 -0.0031827 -0.0068948 -0.1309989 -0.0965794 0.1437434 -0.0025951 0.0849251 0.0049138 0.0004722 0.0031563 -0.0028615 0.0605459 1.2416387 -0.1750251 -0.0021064 -0.6991045 1.0025172 -0.0143907 0.0073667 -0.0152483 0.2297112 0.3752621 -0.0520645 -0.0016573 -0.1741133 0.031497 -0.0021181 0.0013057 -0.0029243 -0.1431153 -1.1137965 -0.0950128 0.0079887 -0.163438 0.0197527 -0.0011601 0.01103 -0.0014856 -0.0959668 2.4619691 -0.1782124 -0.0118127 0.3018672 1.2414523 -0.0207955 -0.0235681 -0.0180445 0.2481928 0.0568281 -0.0804925 0.0017667 -0.0647037 -0.0936514 0.0058942 0.001551 0.0064546 0.1630148 0.1347486 0.0600382 -0.0013964 0.0408592 0.0780663 0.0022486 -0.0010259 0.0021739 0.1862339 -0.1357311 -0.0410818 0.0015994 -0.0282151 0.0879556 0.0017383 0.000626 0.0017354 0.1578688 0.0443035 -0.0513134 0.0013812 -0.0856051 -0.0998362 0.0058622 0.0021257 0.0058195 0.1503857 0.1664799 0.010186 0.0003203 -0.0974097 0.0982186 0.0050629 0.0023722 0.0047831 0.3095353 0.0419629 -0.1411394 0.0058257 -0.0121987 -0.1099169 0.0082305 0.000342 0.0093569 0.1073103 -0.0204831 0.0380957 -0.1088072 0.0201377 0.0526527 -0.0402625 -0.1446445 0.0149571 -0.0344526 -0.0143961 0.0460917 0.1050086 0.0337266 0.0534615 0.032201 0.1419147 -0.0221333 -0.0432162 0.0574211 0.0177982 0.0003953 -0.0139788 -0.0492339 0.0043648 0.000943 0.0043184 0.1701392 0.1305526 -0.0168436 0.0008064 -0.0464549 0.0293245 0.0030887 0.0013673 0.0029577 0.1752131 0.3414809 -0.1020884 0.0026492 -0.1587008 0.1748634 0.0057536 0.0036681 0.0053285 0.4036863 unknown
polarizability: 298.2856673|-5.9614894|137.4584964|-1.0480966|-1.6320679|59.1825376 unknown
InChI: InChI=1S/C11H11NO3/c1-8-3-2-4-9(7-8)12-10(13)5-6-11(14)15/h2-7,12,14H,1H3
charge 0 multiplicity 1
26 atoms
O  0.914043 -1.746315 0.038035
O  5.806155 -0.415697 -0.026734
O  4.813171 1.692666 -0.059976
N  -0.182822 0.343315 -0.000053
C  -1.554389 -0.034609 0.012871
C  -3.899648 0.743478 0.001209
C  -2.515007 1.015825 -0.007444
C  -1.98297 -1.387446 0.043881
C  -4.320654 -0.614021 0.032002
C  -3.369217 -1.655711 0.052717
C  -4.918797 1.869845 -0.02229
C  0.950024 -0.476732 0.011581
C  2.228199 0.298076 -0.012494
C  3.434784 -0.333013 -0.009511
C  4.696082 0.441346 -0.035131
H  -2.174629 2.06071 -0.0315
H  -1.243668 -2.189396 0.059865
H  -5.392113 -0.847308 0.039136
H  -3.706079 -2.698119 0.076481
H  -0.009042 1.351569 -0.022421
H  -4.43386 2.860397 -0.06369
H  -5.588053 1.785453 -0.898903
H  -5.560153 1.846609 0.87878
H  2.204618 1.397265 -0.034034
H  3.49143 -1.425923 0.011293
H  6.640396 0.12714 -0.044067
