program: Gaussian 09
title: 000247649
version: EM64L-G09RevD.01
frameworkgroup: C1[X(C10H12N2O3)]
method: RPBEPBE
basis: SDD
operation: Freq
keyword: #p
keyword: freq=noraman
keyword: PBEPBE/SDD
title: #p freq=noraman PBEPBE/SDD
converged: NO YES NO NO
title: Mulliken charges:
elementType: O O O N N C C C C C C C C C C H H H H H H H H H H H H
charge: -0.228069 -0.177991 -0.208205 -0.183268 -0.047514 -0.271936 -0.271472 -0.201840 -0.202616 0.162370 0.187061 -0.213733 -0.214400 -0.597842 -0.598676 0.289164 0.290143 0.284797 0.283546 0.256404 0.255871 0.248958 0.234923 0.223119 0.237696 0.236644 0.226866
chargesum: 0.00000
title: Mulliken charges with hydrogens summed into heavy atoms:
elementType: O O O N N C C C C C C C C C C
charge: -0.228069 -0.177991 -0.208205 -0.183268 -0.047514 0.017228 0.018671 0.082958 0.080930 0.162370 0.187061 0.042670 0.041471 0.109158 0.102530
polarizability: 1.47371736e+02 1.66570033e+00 1.26800661e+02 -5.01290921e+00 1.23102618e+00 8.69317795e+01
1716.lowfreq: -10.6348 -1.9668 -0.0009 -0.0007 -0.0005 11.6985 45.8039 58.1843 82.0864
frequency: 45.6619 58.1576 82.0653 143.2144 146.5218 188.1455 194.9145 205.4868 211.4305 280.0819 309.7899 360.5323 412.5570 419.0879 476.0927 512.9757 556.5067 581.8958 617.8712 623.6051 693.5289 710.3435 742.5109 779.0462 787.0052 813.8226 834.8172 868.6206 907.5469 911.1057 914.2797 934.8418 958.9413 965.1535 990.8226 1020.4142 1033.6334 1053.2673 1079.5402 1087.2456 1124.7875 1129.5404 1164.0074 1173.0499 1196.7200 1208.3988 1228.9698 1229.5455 1235.4730 1252.8725 1260.9555 1280.3305 1291.7985 1304.4778 1415.3451 1436.3583 1454.2648 1466.0278 1481.0777 1493.8504 1575.2320 1639.2271 1704.3030 2948.7343 2954.3537 3055.0100 3057.4081 3072.5773 3084.3272 3098.4650 3105.2686 3141.4277 3147.4468 3188.1916 3219.7831
redmass: 2.8854 4.7046 5.8352 7.3598 3.1633 4.6651 1.1123 1.2115 3.5926 3.1383 5.5039 4.5148 3.2867 4.3224 5.0646 4.3012 5.7150 6.4515 4.7363 4.4869 6.4236 1.8932 8.2288 4.8415 5.5481 6.8475 3.0694 4.3972 2.2113 2.6468 1.9575 2.4299 2.4145 4.4224 1.8090 1.6490 3.6486 3.0356 1.3548 1.2242 1.4585 1.5078 5.6873 1.3439 1.2596 1.3351 1.3933 2.9429 2.3305 1.8254 1.5779 1.4624 1.8377 5.4437 1.1347 1.1572 1.0480 1.0644 1.0489 1.0533 6.1173 11.6907 12.3394 1.0420 1.0421 1.0915 1.0907 1.0858 1.0876 1.1011 1.1015 1.0900 1.0954 1.0883 1.1112
irintensity: 0.1159 4.5352 0.4153 5.5513 6.1296 0.0843 0.7742 0.3209 3.2592 4.5242 11.5413 5.0318 4.9556 1.1558 0.7009 0.1731 2.3066 16.8933 12.0017 11.9112 13.5596 51.4556 1.3494 9.8823 15.0982 14.2159 71.6263 9.3236 2.8114 10.8439 1.8661 0.4774 28.8391 16.8083 6.9324 14.5919 16.0375 48.6627 37.3337 1.8127 6.8698 25.3616 125.5725 5.6386 0.4837 19.4609 0.3547 2.3212 12.7890 1.7670 0.3921 4.9381 13.6040 58.8469 5.8586 2.1751 10.4693 34.5897 3.5479 21.6281 2.7623 463.0771 63.4617 49.8793 61.1636 16.8978 32.9231 3.6988 6.3555 16.4999 30.0079 12.3516 1.5900 1.0954 6.4371
temp: 298.150 k
press: 1.00000 atm
elementType: 8 8 8 7 7 6 6 6 6 6 6 6 6 6 6 1 1 1 1 1 1 1 1 1 1 1 1
symmnumber: 1
zpe: 552272.1 jmol-1
zpe.correction: 0.210349 hartree
zpe.thermalcorrener: 0.223497 hartree
zpe.thermalcorrenthalpy: 0.224441 hartree
zpe.thermalcorrgfe: 0.170490 hartree
zpe.sumelectzpe: -722.253906 hartree
zpe.sumelectthermal: -722.240758 hartree
zpe.sumelectthermalent: -722.239814 hartree
zpe.sumelectthermalfe: -722.293765 hartree
dipole: 2.0530 -1.1371 -2.0525
dipole: 3.1178
quadrupole: -72.7710 -99.5104 -85.7718
quadrupole: 2.0581 -6.2816 -0.4196
quadrupole: 13.2467 -13.4926 0.2459 2.0581 -6.2816 -0.4196
hfenergy: -722.4642554 hartree
pointgroup: C01 [X(C10H12N2O3)]
dipole: 0.8074789 0.398835 0.8327734 debye
polarizability: 147.2588238|-2.1711456|126.6442603|5.3378825|3.0360261|87.2010928 unknown
InChI: InChI=1S/C10H12N2O3/c1-11(2)12-9(13)7-5-3-4-6(15-5)8(7)10(12)14/h3-8H,1-2H3
charge 0 multiplicity 1
27 atoms
O  1.562574 0.189027 -1.329393
O  -0.817756 -2.467666 0.076909
O  -1.14901 2.217374 0.44565
N  -1.305602 -0.137749 0.205102
N  -2.651735 -0.232696 -0.231766
C  0.925606 -0.812384 0.717201
C  0.8215 0.740052 0.847863
C  1.969446 -0.965824 -0.466443
C  1.821383 1.227809 -0.282415
C  -0.468508 -1.292362 0.300382
C  -0.628201 1.078083 0.49793
C  3.320948 -0.49566 0.081923
C  3.229711 0.858816 0.195208
C  -2.851444 0.350611 -1.581799
C  -3.623237 0.188964 0.80574
H  1.251136 -1.342789 1.625257
H  1.080119 1.15177 1.835538
H  1.913153 -1.903953 -1.030286
H  1.633632 2.230788 -0.682592
H  4.142278 -1.152249 0.371971
H  3.959287 1.561862 0.599294
H  -2.12442 -0.097567 -2.278573
H  -2.749382 1.456098 -1.605109
H  -3.865807 0.075404 -1.918662
H  -3.592975 1.276673 1.026261
H  -3.431889 -0.378157 1.731986
H  -4.632007 -0.077677 0.445824
