program: Gaussian 09
title: 000247635
version: EM64L-G09RevD.01
frameworkgroup: C1[X(C12H9N3)]
method: RPBEPBE
basis: SDD
operation: Freq
keyword: #pfreq=noraman
keyword: PBEPBE/SDD
title: #p freq=noraman PBEPBE/SDD
converged: YES YES NO YES
title: Mulliken charges:
elementType: N N N C C C C C C C C C C C C H H H H H H H H H
charge: -0.465906 -0.071130 0.003951 0.272521 0.109614 0.015849 0.317772 -0.366000 -0.339687 -0.211531 -0.229832 -0.279706 -0.445819 -0.196508 -0.340161 0.309365 0.234856 0.252864 0.226198 0.228352 0.207041 0.290450 0.231951 0.245495
chargesum: 0.00000
title: Mulliken charges with hydrogens summed into heavy atoms:
elementType: N N N C C C C C C C C C C C C
charge: -0.156541 -0.071130 0.003951 0.272521 0.109614 0.015849 0.317772 -0.131144 -0.086823 0.014667 -0.001480 -0.072666 -0.155368 0.035443 -0.094666
polarizability: 2.88704293e+02 5.62959254e+00 1.43087483e+02 -2.34205815e-03 9.31593494e-04 5.70012454e+01
1716.lowfreq: -9.0402 -7.2173 -1.6969 -0.0009 -0.0006 -0.0003 20.9012 64.6484 105.1417
frequency: 20.2131 64.6448 105.1417 176.4830 250.2545 286.2063 303.2215 322.9564 387.1109 426.6231 494.0422 517.0847 558.4798 573.0552 587.4491 608.0147 616.9165 698.7584 699.3946 714.0297 755.0733 768.6185 799.9874 811.4197 858.2937 882.5455 915.0175 924.2448 938.7693 954.2620 978.4957 979.0208 994.1923 1005.4581 1021.8159 1070.6301 1112.4259 1126.3965 1160.8073 1199.4709 1218.1814 1244.7938 1260.2967 1302.7988 1309.6249 1319.5547 1345.3234 1410.8564 1417.9523 1425.2894 1447.9969 1477.9579 1520.0682 1553.7284 1586.4953 1598.5601 1632.0219 3119.9019 3131.9289 3137.7176 3144.5881 3159.4619 3160.4753 3168.3280 3173.9301 3604.5568
redmass: 4.2858 5.5412 5.1801 4.4709 4.2745 7.1453 4.4530 5.0044 3.0919 3.0143 4.5506 5.1980 7.6948 2.0650 1.5721 7.2013 7.0745 5.0830 6.9571 1.8799 1.3938 3.4588 5.1683 1.8587 1.4950 6.5047 1.3622 8.4588 1.3804 1.4628 1.4049 1.3202 3.7328 2.1621 4.3842 2.1801 1.6086 1.7215 1.1405 1.2931 2.6668 1.7001 2.5695 3.9902 4.3623 1.8077 1.6446 2.7732 2.7614 2.6026 2.5493 3.2908 5.2567 5.6049 5.8734 6.6749 7.3792 1.0890 1.0856 1.0899 1.0906 1.0959 1.0926 1.0997 1.0991 1.0808
irintensity: 0.0914 0.4057 0.0540 1.1232 6.7705 0.0587 0.2587 2.5462 3.3375 11.9715 1.6475 8.2395 1.9672 24.4053 47.6962 1.1504 2.8850 2.0313 0.5571 52.6071 123.5488 7.8851 4.1250 32.9273 0.0547 1.5173 0.4450 2.0138 4.3251 5.1205 0.0214 0.0258 8.1764 7.8395 1.8263 0.9596 9.2193 6.5561 0.9718 10.2817 3.6245 9.2427 24.2046 5.8874 5.9980 13.7798 42.1242 3.8828 28.3966 48.7816 26.4772 1.1651 4.0472 6.1528 1.1901 10.8584 1.8246 15.7151 0.1117 12.7722 10.7838 25.0322 8.3940 25.6271 21.9906 29.3338
temp: 298.150 k
press: 1.00000 atm
elementType: 7 7 7 6 6 6 6 6 6 6 6 6 6 6 6 1 1 1 1 1 1 1 1 1
symmnumber: 1
zpe: 481732.7 jmol-1
zpe.correction: 0.183482 hartree
zpe.thermalcorrener: 0.194365 hartree
zpe.thermalcorrenthalpy: 0.195309 hartree
zpe.thermalcorrgfe: 0.145261 hartree
zpe.sumelectzpe: -625.923174 hartree
zpe.sumelectthermal: -625.912292 hartree
zpe.sumelectthermalent: -625.911347 hartree
zpe.sumelectthermalfe: -625.961395 hartree
dipole: -1.0695 5.4265 0.0023
dipole: 5.5309
quadrupole: -78.6054 -79.3114 -92.2934
quadrupole: 10.2328 -0.0044 0.0031
quadrupole: 4.7980 4.0920 -8.8900 10.2328 -0.0044 0.0031
hfenergy: -626.1066566 hartree
pointgroup: C01 [X(C12H9N3)]
dipole: -0.4284816 2.1334271 0.0012798 debye
dipolederiv: -0.4914619 0.0435721 -0.0024925 -0.0901243 -0.4655794 -0.0014511 -0.0027155 0.000491 -0.2738703 -0.3359074 -0.1594553 -0.0015036 -0.0115281 -0.3966797 -0.0006073 -0.0014752 -0.0025497 -0.2544078 -0.2632942 -0.0040019 -0.0002268 0.0073243 -0.2856882 -0.0000476 -0.0002862 -0.0001121 -0.2464706 0.121016 0.1290199 0.0008083 0.2687962 -0.0338654 0.0029662 0.0014832 0.0012572 0.0791836 0.1816638 -0.1235709 0.0009396 -0.2001095 0.6222369 -0.0009399 0.0003445 -0.0000529 0.0890111 0.1110246 0.0734126 0.0012392 -0.101167 -0.0361738 -0.0014155 0.0009845 0.0007638 0.0180264 0.5415009 0.0942747 0.0062861 -0.0509687 -0.1799379 -0.0012762 0.0061017 0.0006931 0.0645938 0.1412634 -0.1012667 0.0039837 -0.0822914 0.0553654 -0.0003485 0.0039215 -0.0005823 -0.1949339 0.2432026 -0.0221472 0.0049587 0.0879969 0.1220044 0.0019729 0.0052421 0.000547 -0.1490759 -0.1719438 -0.0141856 -0.0001704 -0.2857561 0.0913236 -0.0029001 -0.0008372 0.0006029 -0.1682141 -0.1433072 0.0974303 0.0006979 0.393712 -0.0445512 0.0054576 0.0016186 0.0016213 -0.1809931 -0.0178518 -0.0166493 0.0017315 -0.1031882 0.0993349 -0.0008112 0.0016131 0.0002936 -0.1431867 -0.103413 -0.042058 -0.000744 0.1871911 0.2433973 0.0031189 -0.0001612 0.0000629 -0.0481493 -0.1969119 0.065629 -0.0011119 0.3380395 0.0147416 0.0047463 -0.0005901 0.0011661 -0.100372 0.1987801 0.0435058 0.0040255 -0.2348833 0.1048631 -0.0026405 0.0035013 0.0010093 -0.0842666 0.2016816 -0.0257083 -0.0018866 -0.0223229 0.1537251 -0.0009616 -0.0020304 -0.0011588 0.3403431 0.0714711 -0.0155051 -0.0014322 0.043124 -0.0996704 -0.0002732 -0.0012814 -0.001024 0.1816784 0.097962 0.0252152 -0.0007838 -0.0245797 -0.0597708 -0.0010102 -0.0008905 -0.0003649 0.1663117 -0.1010527 0.0879639 -0.0030739 0.0892721 0.0433186 0.0007699 -0.0030571 0.0007607 0.1633534 -0.100258 -0.0953008 -0.0036417 -0.09822 0.031717 -0.0016393 -0.0036647 -0.0016054 0.1656407 0.0459608 0.1227875 -0.000976 0.1062524 -0.0620046 0.0009471 -0.0010026 0.0011322 0.1399692 0.0931799 -0.0600246 -0.0006719 -0.0869245 0.0429528 -0.0013232 -0.0006292 -0.0009343 0.1326555 0.0093838 -0.0808697 -0.0022056 -0.1273542 -0.0503815 -0.0021865 -0.0023578 -0.0015835 0.1608843 -0.1326888 -0.0220675 -0.0037494 -0.0022908 0.0893226 -0.000147 -0.0038314 -0.0004333 0.1422891 unknown
polarizability: 288.6231096|6.14736|143.1290136|3.0052234|0.3180263|57.0408976 unknown
InChI: InChI=1S/C12H9N3/c1-2-6-11-10(5-1)14-12(15-11)9-4-3-7-13-8-9/h1-8,14H
charge 0 multiplicity 1
24 atoms
N  -0.534535 1.165108 0.004504
N  -0.462208 -1.117331 -0.001725
N  3.827075 -1.252596 0.055292
C  -1.87129 0.746447 -0.013744
C  0.277635 0.013389 0.011463
C  -1.803549 -0.691451 -0.017263
C  1.743021 0.051448 0.030595
C  -3.095002 1.446931 -0.027088
C  -2.995028 -1.454267 -0.034545
C  -4.27023 0.66567 -0.044146
C  -4.22144 -0.760992 -0.047809
C  2.494837 1.256958 0.043302
C  2.468706 -1.17674 0.037234
C  3.903561 1.191972 0.062002
C  4.527246 -0.076543 0.067339
H  -0.21128 2.129889 0.01247
H  -3.144332 2.540813 -0.024511
H  -2.949209 -2.547231 -0.037319
H  -5.245032 1.165539 -0.054922
H  -5.160702 -1.324183 -0.061313
H  2.003743 2.237676 0.03894
H  1.916375 -2.121195 0.027907
H  4.508869 2.103655 0.072297
H  5.618873 -0.169463 0.081938
