program: Gaussian 09
title: 000247637
version: EM64L-G09RevD.01
frameworkgroup: C1[X(C14H14N6O2)]
method: RPBEPBE
basis: SDD
operation: Freq
keyword: #p
keyword: freq=noraman
keyword: PBEPBE/SDD
title: #p freq=noraman PBEPBE/SDD
converged: NO YES NO NO
title: Mulliken charges:
elementType: O O N N N N N N C C C C C C C C C C C C C C H H H H H H H H H H H H H H
charge: -0.278056 -0.270504 -0.158938 -0.219827 -0.459278 -0.063241 -0.364694 0.050273 0.154109 0.126379 0.142608 0.213331 0.169778 -0.613881 -0.599441 0.445210 -0.390496 -0.378973 -0.365512 -0.224087 -0.218639 -0.233595 0.330334 0.270997 0.247624 0.247606 0.267202 0.249086 0.249079 0.280295 0.203596 0.221578 0.278249 0.229370 0.230556 0.231903
chargesum: 0.00000
title: Mulliken charges with hydrogens summed into heavy atoms:
elementType: O O N N N N N N C C C C C C C C C C C C C C
charge: -0.278056 -0.270504 -0.158938 -0.219827 -0.128944 -0.063241 -0.084398 0.050273 0.154109 0.126379 0.142608 0.213331 0.169778 0.152345 0.165926 0.445210 -0.186901 -0.157395 -0.087263 0.005283 0.011917 -0.001692
polarizability: 4.60636426e+02 -1.63752499e+01 2.15757387e+02 8.88748441e-03 9.67974728e-03 8.55355445e+01
1716.lowfreq: -2.8109 -0.9053 -0.0011 -0.0006 0.0009 4.6594 17.6196 30.5534 33.2546
frequency: 17.5274 30.5223 33.2520 73.6041 90.6804 103.8392 110.3957 119.4527 121.2234 146.4687 182.9771 185.9048 197.2196 241.8922 258.5690 298.9323 305.5240 322.6041 348.3232 361.7994 378.0977 402.6700 404.1766 428.7738 484.6890 496.1794 506.8855 536.6420 579.5836 601.2952 614.5317 621.8439 639.7438 672.6163 688.6443 698.6131 702.8747 731.3289 761.5713 770.9271 790.0242 854.8714 876.6674 913.9557 924.5230 945.0778 963.4707 984.0681 986.9469 994.4209 1004.8080 1023.0046 1034.9274 1075.2669 1093.3745 1108.7104 1129.6765 1132.4155 1173.7016 1184.9901 1195.5002 1222.4293 1227.4724 1240.1346 1262.1673 1283.1287 1314.5654 1331.9139 1371.5571 1381.8069 1392.1175 1415.2334 1430.5684 1438.8106 1461.9902 1473.0615 1478.6189 1478.8947 1482.5611 1487.1750 1530.7775 1565.1295 1567.8640 1593.5054 1601.5114 1612.6668 1630.5406 1662.1229 2960.4958 3007.9119 3009.9412 3097.4609 3101.4184 3114.4240 3130.6957 3134.8429 3139.2192 3143.2557 3157.5851 3168.7750 3380.7305 3585.4944
redmass: 4.5405 4.5220 5.8810 4.0349 1.1339 1.3314 2.6713 3.7761 5.6120 5.3911 3.3669 3.7274 6.7477 6.6066 4.5542 4.3846 3.2516 5.3827 4.0361 6.7348 7.7234 6.1959 2.8391 8.5843 8.3358 6.7939 2.2880 1.5245 6.8425 1.2539 6.4173 6.9089 9.5961 5.9720 6.9777 1.7884 10.7123 11.0854 5.1777 1.7304 6.6037 1.2534 4.4609 1.3796 4.7918 1.5617 3.2086 1.3736 6.2713 6.6477 1.3341 2.1915 3.4247 2.2854 2.3966 3.5570 1.3024 1.2981 1.0582 1.1222 2.9507 2.2575 2.2897 1.9178 5.6172 4.5000 1.8155 1.5728 3.2664 4.4876 4.7518 1.2874 1.3291 2.3248 2.1057 1.0435 1.0734 1.0421 2.1836 1.4221 2.4102 6.0951 5.1877 5.8836 6.6160 6.2508 8.0631 10.2184 1.0867 1.0335 1.0327 1.1025 1.1021 1.0879 1.0866 1.1024 1.1013 1.0920 1.0958 1.1009 1.0746 1.0816
irintensity: 0.4478 0.0447 0.2475 0.0321 0.0923 0.3343 0.1217 3.5025 8.4259 0.7287 0.6157 50.1929 0.4126 1.0709 8.9505 0.0536 2.5506 0.6073 15.9656 1.6292 7.1614 18.9033 0.1057 2.6874 16.9487 7.2107 5.4934 6.6426 3.2621 207.0889 1.3087 27.2035 1.2852 3.5540 7.9730 48.1233 3.4687 20.0083 1.2030 46.1487 1.0569 0.7340 1.1054 8.9736 6.4651 32.3071 40.7269 0.0592 0.6586 60.1411 1.0737 19.0663 99.2592 100.2970 109.3877 5.4618 0.3047 0.1829 0.3118 4.8681 144.1759 16.5041 5.8925 18.2240 13.9589 13.3673 35.4412 39.7605 5.0150 1.3664 1.7466 5.9193 61.9127 29.7571 404.7364 17.9612 7.3871 16.8115 6.0447 363.8095 43.9467 417.4286 113.7249 61.2113 700.5530 90.8364 245.6623 646.6238 61.1884 29.6681 37.7681 16.9934 19.1495 10.6448 0.1916 0.9235 0.5693 23.3955 24.4020 27.3145 17.9867 88.5997
temp: 298.150 k
press: 1.00000 atm
elementType: 8 8 7 7 7 7 7 7 6 6 6 6 6 6 6 6 6 6 6 6 6 6 1 1 1 1 1 1 1 1 1 1 1 1 1 1
symmnumber: 1
zpe: 716164.6 jmol-1
zpe.correction: 0.272773 hartree
zpe.thermalcorrener: 0.292527 hartree
zpe.thermalcorrenthalpy: 0.293471 hartree
zpe.thermalcorrgfe: 0.222551 hartree
zpe.sumelectzpe: -1019.290744 hartree
zpe.sumelectthermal: -1019.270990 hartree
zpe.sumelectthermalent: -1019.270045 hartree
zpe.sumelectthermalfe: -1019.340966 hartree
dipole: -5.8858 -3.0459 -0.0004
dipole: 6.6272
quadrupole: -131.4562 -117.9141 -131.5247
quadrupole: 5.0343 0.0004 0.0004
quadrupole: -4.4912 9.0509 -4.5597 5.0343 0.0004 0.0004
hfenergy: -1019.5635166 hartree
pointgroup: C01 [X(C14H14N6O2)]
dipole: 2.3195626 -1.1907493 0.0001624 debye
polarizability: 460.5265857|17.1765639|215.8672274|0.0089191|-0.0096506|85.5355445 unknown
InChI: InChI=1S/C14H14N6O2/c1-19-11-10(12(21)20(2)14(19)22)16-13(17-11)18-15-8-9-6-4-3-5-7-9/h3-8,16,18H,1-2H3
charge 0 multiplicity 1
36 atoms
O  -4.436122 -2.471883 0.000076
O  -5.067441 2.214621 -0.000548
N  -2.85556 1.425089 -0.000436
N  -4.730615 -0.105381 -0.00025
N  -1.395789 -1.813686 0.000026
N  -0.630767 0.345497 -0.000308
N  0.998312 -1.483316 -0.000023
N  2.087645 -0.637991 -0.000018
C  -2.531809 -0.982259 -0.000143
C  -2.020893 0.321708 -0.000293
C  -3.925339 -1.306902 -0.000134
C  -4.263462 1.238537 -0.000354
C  -0.288278 -0.969351 -0.000096
C  -2.298026 2.790982 -0.000571
C  -6.202197 -0.266582 -0.000237
C  4.499366 -0.366778 0.000031
C  3.285607 -1.189844 0.000022
C  5.771412 -1.004042 0.000112
C  4.437639 1.057254 -0.000044
C  6.956785 -0.238467 0.000117
C  5.622919 1.81599 -0.000039
C  6.887419 1.173938 0.000042
H  -1.433943 -2.832452 0.000199
H  -3.143809 3.493643 -0.001324
H  -1.672227 2.943988 -0.895577
H  -1.673347 2.944688 0.895108
H  -6.411822 -1.346512 -0.000291
H  -6.636722 0.212093 -0.893127
H  -6.636706 0.211976 0.892727
H  1.120783 -2.50712 0.00001
H  3.426591 -2.291284 0.000057
H  5.828838 -2.100327 0.000169
H  3.454814 1.539415 -0.000106
H  7.930779 -0.740075 0.00018
H  5.567486 2.910322 -0.000099
H  7.806977 1.769608 0.000045
