program: Gaussian 09
title: 000247628
version: EM64L-G09RevD.01
frameworkgroup: C1[X(C9H15NO2)]
method: RPBEPBE
basis: SDD
operation: Freq
keyword: #p
keyword: freq=noraman
keyword: PBEPBE/SDD
title: #p freq=noraman PBEPBE/SDD
converged: YES YES NO NO
title: Mulliken charges:
elementType: O O N C C C C C C C C C H H H H H H H H H H H H H H H
charge: -0.309902 -0.300404 -0.460256 0.248304 -0.384076 -0.707485 -0.706892 0.166248 0.291872 -0.254387 -0.511449 -0.663345 0.204391 0.250298 0.224096 0.217545 0.261114 0.340261 0.216848 0.225617 0.227737 0.219195 0.235407 0.213857 0.247169 0.224034 0.284204
chargesum: 0.00000
title: Mulliken charges with hydrogens summed into heavy atoms:
elementType: O O N C C C C C C C C C
charge: -0.309902 -0.300404 -0.119995 0.248304 0.070613 -0.004731 -0.036690 0.166248 0.291872 0.200215 -0.227245 0.021716
polarizability: 1.37736620e+02 -3.47381015e+00 8.87083625e+01 -1.11074413e+01 2.28871030e+00 1.01232720e+02
1716.lowfreq: -16.8790 -5.1864 0.0004 0.0005 0.0007 3.7122 32.4062 47.7148 80.2922
frequency: 31.3715 47.6215 80.2820 90.3664 101.8850 120.2489 166.0410 178.6511 215.8346 231.8040 244.8554 250.7402 302.5075 329.7064 365.0311 379.3354 419.2947 439.7470 541.6415 543.6544 573.4695 631.8824 654.0723 669.4241 704.3659 709.5897 788.6201 800.3098 833.6271 894.8239 924.1826 973.6937 1001.3511 1035.9173 1056.1121 1063.8412 1094.7816 1114.5419 1153.7996 1163.3340 1186.6831 1226.5065 1281.2244 1294.1143 1330.4885 1355.9625 1384.6436 1386.7949 1390.7717 1451.9108 1458.8958 1461.6074 1463.9175 1475.3731 1476.2188 1483.4955 1484.3942 1487.0484 1658.0571 2136.3922 2983.1066 2989.3887 2997.5218 3003.8503 3025.9850 3060.1027 3079.9755 3084.9867 3086.7244 3087.5393 3102.8625 3111.4362 3114.2108 3425.4744 3567.2173
redmass: 2.6786 3.3702 6.1485 3.5475 3.4038 3.4795 1.9083 2.4741 1.5482 1.4817 1.1732 1.4866 3.0482 3.8019 3.0869 3.7204 3.6368 3.5880 1.1877 4.1345 4.0834 1.2165 4.7901 1.2549 8.1796 3.3546 1.3322 1.2200 2.9712 2.0975 2.9143 2.3088 1.5007 2.8175 1.5972 3.8322 2.1560 3.4148 1.7132 2.3260 2.2088 2.6688 1.1089 1.3407 1.4130 1.2412 1.1913 1.2351 1.2188 1.2116 1.0980 1.0672 1.1488 1.2089 1.0885 1.0520 1.0839 1.0659 8.4790 6.0243 1.0355 1.0358 1.0361 1.0592 1.0593 1.1003 1.0989 1.0974 1.1017 1.1033 1.1008 1.1016 1.1058 1.1597 1.0779
irintensity: 0.1204 1.7542 7.2338 0.3299 0.5270 0.7603 1.6642 0.9320 4.5865 2.1393 0.4840 1.2811 13.6170 11.3703 1.2777 1.2528 2.8821 4.5292 96.7277 5.3853 1.1363 79.7568 3.7773 62.1748 21.5473 8.0397 12.3334 4.5433 2.4350 22.7230 17.8489 21.2734 22.4957 166.7101 3.1350 98.9572 30.3320 20.4460 68.4010 34.9552 69.6400 133.7258 3.6499 5.8128 6.6095 5.7032 15.3749 22.8203 29.6262 90.4126 56.6813 22.5543 90.4331 149.8702 18.5553 11.3733 48.9125 12.2987 235.0863 1.5446 27.6402 21.4933 10.6953 29.6919 37.0298 0.2457 33.6764 48.9239 32.5416 0.2498 30.6474 11.0354 36.1461 68.0186 42.4412
temp: 298.150 k
press: 1.00000 atm
elementType: 8 8 7 6 6 6 6 6 6 6 6 6 1 1 1 1 1 1 1 1 1 1 1 1 1 1 1
symmnumber: 1
zpe: 589264.0 jmol-1
zpe.correction: 0.224439 hartree
zpe.thermalcorrener: 0.239145 hartree
zpe.thermalcorrenthalpy: 0.240089 hartree
zpe.thermalcorrgfe: 0.182571 hartree
zpe.sumelectzpe: -556.156384 hartree
zpe.sumelectthermal: -556.141678 hartree
zpe.sumelectthermalent: -556.140734 hartree
zpe.sumelectthermalfe: -556.198252 hartree
dipole: 0.3636 0.0127 -1.4850
dipole: 1.5290
quadrupole: -61.4684 -72.9249 -74.0228
quadrupole: -0.2328 0.2482 0.7269
quadrupole: 8.0036 -3.4529 -4.5508 -0.2328 0.2482 0.7269
hfenergy: -556.380823 hartree
pointgroup: C01 [X(C9H15N1O2)]
dipole: 0.1508973 0.5039888 0.2916791 debye
polarizability: 138.0327784|10.9461287|99.8808896|2.2166895|4.1042923|89.7640338 unknown
InChI: InChI=1S/C9H15NO2/c1-5-9(4,6-2)10-8(11)12-7-3/h1,10H,6-7H2,2-4H3
charge 0 multiplicity 1
27 atoms
O  -2.093646 1.080581 -0.209156
O  -1.358751 -1.059801 -0.891153
N  0.129442 0.649705 -0.22883
C  1.421101 -0.08143 -0.421917
C  1.481242 -1.357895 0.487566
C  1.585334 -0.491597 -1.916498
C  1.332301 -1.077246 1.994128
C  2.50453 0.863281 -0.051437
C  -1.107436 0.105514 -0.479926
C  -3.502589 0.628947 -0.377119
C  3.42523 1.631383 0.232739
C  -4.024842 -0.027749 0.904203
H  2.449099 -1.855804 0.288121
H  0.679755 -2.035702 0.14269
H  1.568709 0.400013 -2.565744
H  2.545902 -1.015718 -2.059677
H  0.759468 -1.164159 -2.201502
H  0.157046 1.61449 0.103587
H  1.381576 -2.021412 2.566045
H  0.361663 -0.598579 2.216874
H  2.135304 -0.41319 2.362589
H  -4.046394 1.557151 -0.617003
H  -3.549527 -0.070036 -1.230756
H  -5.096506 -0.27688 0.789136
H  -3.475896 -0.961476 1.114304
H  -3.918925 0.652668 1.767044
H  4.234616 2.294142 0.478995
