program: Gaussian 09
title: 000247703
version: EM64L-G09RevD.01
frameworkgroup: C1[X(C12H22O8S2)]
method: RPBEPBE
basis: SDD
operation: Freq
keyword: #p
keyword: freq=noraman
keyword: PBEPBE/SDD
title: #p freq=noraman PBEPBE/SDD
converged: YES YES NO NO
title: Mulliken charges:
elementType: S S O O O O O O O O C C C C C C C C C C C C H H H H H H H H H H H H H H H H H H H H H H
charge: 1.058702 1.056108 -0.280362 -0.290003 -0.418314 -0.415604 -0.519134 -0.498033 -0.518740 -0.496572 0.336120 -0.439942 -0.449202 -0.093311 -0.082566 -0.387990 -0.387125 -0.392398 -0.321710 -0.327324 -0.728764 -0.727987 0.213497 0.206364 0.206288 0.220415 0.254147 0.253381 0.221954 0.202117 0.201521 0.219310 0.191636 0.207516 0.225710 0.276125 0.227182 0.275767 0.286358 0.287183 0.286341 0.286109 0.287274 0.287956
chargesum: 0.00000
title: Mulliken charges with hydrogens summed into heavy atoms:
elementType: S S O O O O O O O O C C C C C C C C C C C C
charge: 1.058702 1.056108 -0.280362 -0.290003 -0.418314 -0.415604 -0.519134 -0.498033 -0.518740 -0.496572 0.336120 -0.020081 -0.022499 0.160836 0.170815 0.036080 0.033705 0.006754 0.180125 0.175624 0.131118 0.133352
polarizability: 2.71785263e+02 -1.32227870e+01 2.35912767e+02 -4.69863255e+00 -5.71202832e+00 1.68778040e+02
1716.lowfreq: -10.6958 -6.1021 -1.8290 0.0022 0.0025 0.0028 4.3878 12.1775 14.8708
frequency: -6.3840 7.5507 14.5407 22.6619 25.3926 38.5330 63.7251 73.5020 98.3047 117.2817 128.1264 140.0626 151.6457 158.7486 163.8434 175.3344 190.7685 206.7427 210.6798 226.7348 245.2317 256.8362 270.8726 279.8182 291.9865 319.5390 334.9342 344.1032 353.2228 360.7937 397.9003 403.7504 423.2633 444.3906 464.4888 498.6953 509.6735 526.6119 548.2022 595.9191 598.5682 643.0676 709.9293 739.6374 775.5183 801.5136 816.7750 833.1656 839.3473 840.0565 874.5067 910.6167 913.9785 914.6207 916.9401 918.8863 927.2041 933.3414 952.3916 976.9746 991.5710 994.3645 1010.1548 1037.6735 1037.9439 1039.9465 1054.6798 1061.4371 1067.3813 1091.6592 1095.9505 1104.3257 1140.6588 1151.7043 1188.2547 1208.3487 1229.8571 1245.5957 1254.5935 1267.3432 1270.6543 1283.9758 1308.5527 1315.2023 1316.9752 1320.2438 1333.2671 1338.2769 1338.7491 1344.8836 1357.1390 1358.1626 1377.2409 1414.6038 1415.9541 1416.8453 1417.7915 1449.1911 1459.7302 1464.8206 1467.0115 1470.2751 1471.5213 1478.8085 2969.3760 2984.6745 2988.3119 2988.6632 2991.3650 2996.2340 3001.4411 3036.8998 3039.9746 3040.0880 3046.6430 3053.6846 3054.8810 3057.8765 3063.8141 3068.4202 3071.7666 3074.1028 3187.9615 3188.3718 3197.9473 3198.1636
redmass: 7.4044 5.1717 5.8337 5.4906 6.9070 5.2015 4.9451 4.4342 3.7616 6.2156 6.2450 2.5821 1.7267 1.9571 1.8905 1.4623 4.0279 5.9391 2.7262 3.7681 3.9733 2.7765 5.6706 3.3262 4.3123 5.1329 4.8411 6.7034 4.9188 6.5743 4.3578 4.7735 2.5695 3.8061 3.9807 2.9594 6.6927 2.7588 3.4467 9.0774 7.9032 4.0000 8.0043 5.5337 1.4769 2.3095 2.7951 11.5242 2.6844 5.8727 1.7278 2.7070 2.9088 3.0527 3.8795 5.7634 1.4571 3.3036 3.1520 3.2027 1.3707 1.3947 2.3076 2.3644 2.0887 2.0703 1.9847 2.9946 1.3146 2.0744 1.5208 2.2502 1.6815 2.4255 1.1194 1.1622 1.8144 1.3365 1.4028 1.3239 1.3314 1.3492 1.1937 1.1331 1.1330 1.5716 1.4531 1.3139 1.3589 1.4512 1.4671 1.2612 1.4561 1.0507 1.0525 1.0520 1.0507 1.0889 1.0969 1.0852 1.0767 1.0794 1.0798 1.0911 1.0636 1.0564 1.0564 1.0598 1.0598 1.0626 1.0628 1.0961 1.0247 1.0247 1.1010 1.1017 1.0958 1.0967 1.1011 1.0998 1.1011 1.0986 1.1077 1.1077 1.1078 1.1078
irintensity: 5.3320 1.5491 0.4880 4.3678 1.3853 2.5642 0.7248 0.3594 0.7716 7.3032 2.6840 1.8087 0.3059 1.5072 0.5670 1.0688 11.6155 0.0496 2.0768 8.6293 0.9456 6.6378 12.0647 3.9655 10.8187 15.0075 19.7447 9.8221 34.9732 34.5830 12.2288 4.2668 11.9943 43.5658 42.0008 21.4341 41.2892 10.2224 6.1554 19.5501 77.4147 7.2486 5.7807 1.0113 2.1087 26.1070 11.1624 137.2539 9.3458 1.3835 30.3995 9.0098 26.2492 8.8390 43.4689 90.0215 5.3378 32.9951 38.5013 117.5917 89.9227 8.4794 1.9204 20.7993 101.0520 52.4075 70.5027 30.6931 0.6436 17.2251 0.9770 87.9612 3.9949 29.5391 5.7093 22.2042 8.5925 12.8359 6.8499 34.4506 1.4150 12.1501 0.5913 3.0478 2.6320 3.8962 8.8631 1.1234 0.3930 0.4057 17.3984 3.5606 0.9951 16.8283 11.6191 17.3881 11.2766 9.6036 4.9730 8.8016 16.7827 12.7557 27.6979 8.1455 42.7822 22.5074 48.5036 14.8112 19.6104 26.0874 19.4723 67.2913 0.0569 0.0327 48.2765 25.2751 2.0394 1.3067 6.4743 90.3789 19.6022 29.4278 0.0883 0.0840 0.0292 0.0410
temp: 298.150 k
press: 1.00000 atm
elementType: 16 16 8 8 8 8 8 8 8 8 6 6 6 6 6 6 6 6 6 6 6 6 1 1 1 1 1 1 1 1 1 1 1 1 1 1 1 1 1 1 1 1 1 1
symmnumber: 1
zpe: 895317.7 jmol-1
zpe.correction: 0.341009 hartree
zpe.thermalcorrener: 0.366094 hartree
zpe.thermalcorrenthalpy: 0.367038 hartree
zpe.thermalcorrgfe: 0.281893 hartree
zpe.sumelectzpe: -1866.251590 hartree
zpe.sumelectthermal: -1866.226505 hartree
zpe.sumelectthermalent: -1866.225561 hartree
zpe.sumelectthermalfe: -1866.310706 hartree
dipole: -2.6501 1.0256 -0.0375
dipole: 2.8419
quadrupole: -117.7169 -178.0795 -158.1515
quadrupole: -28.1962 2.1840 8.7426
quadrupole: 33.5991 -26.7635 -6.8356 -28.1962 2.1840 8.7426
hfenergy: -1866.5925988 hartree
pointgroup: C01 [X(C12H22O8S2)]
dipole: -0.3259524 1.069479 -0.0102535 debye
polarizability: 227.3420678|-16.0370511|270.7477342|-23.609032|-3.7164419|178.3862684 unknown
InChI: InChI=1S/C12H22O8S2/c1-21(13,14)17-8-10-11(9-18-22(2,15)16)20-12(19-10)6-4-3-5-7-12/h10-11H,3-9H2,1-2H3
charge 0 multiplicity 1
44 atoms
S  -3.940941 1.395196 1.183738
S  2.709901 3.118967 -1.0047
O  -0.542991 -1.786089 -1.082872
O  1.124529 -1.503942 0.581937
O  -2.128681 1.004688 0.791758
O  1.270387 1.886681 -0.958852
O  -4.860384 0.354134 0.34516
O  -4.148342 1.57831 2.774731
O  3.896702 2.515134 -0.077154
O  3.012426 3.586122 -2.520439
C  0.492434 -2.525407 -0.306892
C  -0.136934 -3.610108 0.583024
C  1.510187 -3.10591 -1.302284
C  -0.700372 -0.435701 -0.50594
C  0.663161 -0.162703 0.166979
C  0.950368 -4.443997 1.304909
C  2.590875 -3.946962 -0.580806
C  1.952101 -5.051359 0.294371
C  -1.891098 -0.419042 0.475708
C  1.701742 0.486407 -0.770989
C  -3.920371 3.095138 0.34177
C  1.770796 4.489532 -0.090064
H  -0.746537 -4.264649 -0.069637
H  -0.817205 -3.135042 1.312478
H  1.968876 -2.281538 -1.877379
H  0.951352 -3.73632 -2.020877
H  -0.89876 0.260024 -1.338632
H  0.559181 0.447722 1.079887
H  1.49249 -3.789081 2.013989
H  0.466815 -5.241839 1.899589
H  3.272843 -4.390813 -1.33025
H  3.198105 -3.277989 0.059672
H  1.423901 -5.7791 -0.356356
H  2.73993 -5.61271 0.831674
H  -1.660737 -0.974873 1.402962
H  -2.778817 -0.857119 -0.020881
H  1.739266 -0.017522 -1.753438
H  2.697078 0.451809 -0.284614
H  -4.91412 3.531722 0.512352
H  -3.712164 2.904859 -0.718417
H  -3.119536 3.662267 0.833767
H  2.441664 5.359453 -0.072829
H  1.55499 4.093909 0.910198
H  0.86109 4.66834 -0.67795
