program: Gaussian 09
title: 000247663
version: EM64L-G09RevD.01
frameworkgroup: C1[X(C15H20Cl2N2O2)]
method: RPBEPBE
basis: SDD
operation: Freq
keyword: #p
keyword: freq=noraman
keyword: PBEPBE/SDD
title: #p freq=noraman PBEPBE/SDD
converged: YES YES NO NO
title: Mulliken charges:
elementType: Cl Cl O O N N C C C C C C C C C C C C C C C H H H H H H H H H H H H H H H H H H H H
charge: -0.062060 -0.057705 -0.405604 -0.228491 -0.614942 -0.183094 0.090157 -0.470212 0.277073 -0.407918 -0.549439 0.288739 -0.552254 0.467967 -0.427412 0.077149 -0.413313 -0.382880 -0.391809 -0.586526 -0.584123 0.228964 0.212458 0.204934 0.241074 0.222070 0.222538 0.248809 0.233066 0.282950 0.291676 0.234136 0.246965 0.248194 0.248325 0.248820 0.379803 0.268276 0.293200 0.267640 0.292801
chargesum: 0.00000
title: Mulliken charges with hydrogens summed into heavy atoms:
elementType: Cl Cl O O N N C C C C C C C C C C C C C C C
charge: -0.062060 -0.057705 -0.025801 -0.228491 -0.040316 -0.183094 0.090157 -0.028791 0.277073 0.038089 -0.104831 0.288739 -0.303444 0.467967 -0.194345 0.077149 -0.179177 0.112278 0.105336 -0.025050 -0.023683
polarizability: 2.56035451e+02 4.10473925e+00 2.26591959e+02 -4.92722764e+00 1.65678203e+01 1.37017509e+02
1716.lowfreq: -6.4154 -2.3498 0.0021 0.0022 0.0026 7.2026 13.8725 20.9422 31.5464
frequency: 13.4252 20.9298 31.4330 32.9669 40.3557 64.0148 84.4228 102.3611 123.2134 137.8127 140.4074 179.3613 201.7236 206.8875 219.7822 236.1320 240.4304 265.5604 280.4985 313.1516 338.0930 353.0042 370.9109 384.8940 413.4668 429.6745 474.4495 494.0698 519.7293 530.1708 560.8428 588.8529 615.4369 624.3458 657.8281 671.9804 683.6628 693.6272 703.9496 706.1550 739.8857 783.3896 789.9163 806.8407 816.4230 858.9917 870.4435 881.0104 909.6209 943.7020 952.2215 966.0310 997.6266 1000.0681 1032.6610 1034.0458 1036.7002 1045.0850 1045.3151 1081.8268 1101.0394 1121.0984 1132.1745 1164.0512 1190.0594 1193.6292 1203.3171 1224.1832 1225.4906 1251.3026 1252.4863 1257.6682 1273.9660 1277.2630 1291.3407 1293.8796 1315.9929 1335.5913 1343.4230 1350.5561 1352.4982 1355.0902 1374.2384 1388.9118 1424.5768 1455.5258 1458.0490 1458.2589 1464.2344 1468.8122 1485.3268 1505.3015 1512.8515 1573.5778 1626.5935 1632.8636 1642.4940 2952.7029 2994.1394 3003.0657 3011.1240 3016.7888 3020.3808 3056.2527 3061.8722 3062.3808 3066.9966 3069.7360 3072.7047 3116.1991 3126.1520 3146.6240 3147.1293 3156.6516 3440.2036 3498.0266 3568.4049
redmass: 10.4206 9.7393 8.8624 15.0816 7.4587 4.3341 5.1366 2.5258 2.6486 3.6691 3.5437 1.2574 8.7518 4.0822 3.2561 3.8865 3.7792 3.7523 2.4845 3.9137 4.1066 2.9939 4.1588 2.9863 4.2659 3.7140 3.1417 2.9363 3.2797 4.0431 2.8999 1.4392 2.9575 3.9876 6.1304 1.7436 5.2170 4.6658 3.3263 4.0139 3.2035 1.1276 1.1714 1.4837 3.6610 1.8364 1.5821 2.0964 2.5942 2.0410 2.0044 2.3852 2.1520 1.4777 2.2968 4.2505 3.6233 2.1498 1.8458 2.0341 2.0394 1.4187 1.4794 1.5563 1.7038 1.3811 2.0141 2.1335 2.0273 1.4026 1.2228 1.1678 1.4808 1.7655 1.4158 1.2199 1.7727 1.3462 1.6108 1.2726 1.4243 1.4680 2.9166 2.6406 3.3783 1.1097 1.0928 1.0976 1.0892 1.0889 1.0896 1.1067 2.7525 6.9899 6.2044 8.8403 1.1077 1.0649 1.0600 1.0644 1.0600 1.0608 1.0911 1.1025 1.0579 1.0591 1.1006 1.1027 1.1035 1.0886 1.0894 1.1119 1.1119 1.0937 1.0453 1.0641 1.0966
irintensity: 1.4823 0.9124 0.8443 0.1630 0.9053 0.5795 0.4598 1.0496 1.0818 2.2775 0.4486 33.2455 1.6586 3.5049 6.3700 3.7605 13.3409 5.1665 3.4337 0.9897 27.3211 3.5889 4.4276 2.0180 4.0280 12.2768 10.1979 0.1694 14.7281 20.4372 10.6365 97.0599 21.8246 20.8724 31.5681 186.2598 60.2139 86.3739 39.8606 11.7319 13.3118 2.5037 11.0842 39.2174 0.8676 15.3294 6.0466 1.4684 5.3382 7.0535 6.4617 16.8672 8.6271 4.8981 108.8278 11.7142 4.4710 38.1490 31.8208 12.0503 6.8678 43.3849 13.7057 8.0517 27.8788 1.3864 9.0422 35.1663 3.5575 28.0096 6.6580 19.8302 23.9057 13.0020 8.6351 6.1582 6.4643 3.1309 2.4280 1.7918 6.8454 51.0559 9.7145 35.3816 32.4933 7.6550 15.2079 7.0432 12.0971 13.6049 23.8588 1.7748 235.7898 19.8581 156.3389 184.2294 69.0345 36.7273 17.3473 57.1055 26.2586 14.7103 42.7179 27.3919 10.1429 16.4673 13.3491 31.2179 10.9077 20.4631 10.8561 4.8422 19.7417 23.4665 0.9621 14.8005 2.3956
temp: 298.150 k
press: 1.00000 atm
elementType: 17 17 8 8 7 7 6 6 6 6 6 6 6 6 6 6 6 6 6 6 6 1 1 1 1 1 1 1 1 1 1 1 1 1 1 1 1 1 1 1 1
symmnumber: 1
zpe: 866736.8 jmol-1
zpe.correction: 0.330123 hartree
zpe.thermalcorrener: 0.351885 hartree
zpe.thermalcorrenthalpy: 0.352830 hartree
zpe.thermalcorrgfe: 0.275689 hartree
zpe.sumelectzpe: -1762.083400 hartree
zpe.sumelectthermal: -1762.061637 hartree
zpe.sumelectthermalent: -1762.060693 hartree
zpe.sumelectthermalfe: -1762.137833 hartree
dipole: -0.7960 -1.1245 -1.1564
dipole: 1.7988
quadrupole: -145.4465 -151.0469 -136.4606
quadrupole: 6.1899 4.1296 -2.1358
quadrupole: -1.1285 -6.7289 7.8574 6.1899 4.1296 -2.1358
hfenergy: -1762.4135223 hartree
pointgroup: C01 [X(C15H20Cl2N2O2)]
dipole: 0.3298647 -0.4466025 0.4388115 debye
polarizability: 256.3928128|-2.514451|227.5273559|-3.5281624|-13.0073668|135.72475 unknown
InChI: InChI=1S/C15H20Cl2N2O2/c16-6-8-19(9-7-17)12-4-3-11-2-1-5-15(18,14(20)21)13(11)10-12/h3-4,10,20H,1-2,5-9,18H2
charge 0 multiplicity 1
41 atoms
Cl -5.831443 -2.170756 -0.345159
Cl -2.411253 4.343464 0.240011
O  2.454373 1.721721 1.579105
O  2.555275 2.833307 -0.449812
N  2.602884 0.425263 -1.928602
N  -2.440333 0.19715 0.020125
C  2.547902 0.332969 -0.455962
C  3.847902 -0.367817 0.056791
C  1.281951 -0.460946 -0.068948
C  3.821965 -1.862629 -0.309497
C  2.678611 -2.566173 0.448621
C  1.354518 -1.823744 0.317099
C  0.031507 0.195069 -0.167609
C  -1.194012 -0.471708 0.113191
C  0.132943 -2.485594 0.590943
C  2.50444 1.752544 0.180379
C  -1.114683 -1.845684 0.493347
C  -3.69885 -0.484498 0.362715
C  -2.52772 1.607622 -0.390091
C  -4.232169 -1.28713 -0.839476
C  -2.287583 2.5443 0.810053
H  3.929067 -0.244792 1.152557
H  4.718229 0.132796 -0.40859
H  4.790835 -2.331711 -0.054879
H  3.673221 -1.952463 -1.401109
H  2.948336 -2.639444 1.523824
H  2.557885 -3.605946 0.088616
H  0.02882 1.253333 -0.45318
H  0.158426 -3.543112 0.882869
H  3.251046 1.14975 -2.260758
H  1.680199 0.517332 -2.366148
H  -2.017096 -2.424596 0.710858
H  -4.452698 0.26725 0.656286
H  -3.565685 -1.15191 1.232553
H  -3.532084 1.804402 -0.805287
H  -1.805906 1.83438 -1.194795
H  2.465406 2.655046 1.927446
H  -4.497169 -0.639349 -1.688302
H  -3.538264 -2.077358 -1.159842
H  -3.053675 2.423966 1.590579
H  -1.281016 2.430696 1.237378
