program: Gaussian 09
title: 000020246
version: EM64L-G09RevD.01
frameworkgroup: C1[X(C13H17Cl2NO2)]
method: RPBEPBE
basis: SDD
operation: Freq
keyword: #p
keyword: freq=noraman
keyword: PBEPBE/SDD
title: #p freq=noraman PBEPBE/SDD
converged: YES YES NO NO
title: Mulliken charges:
elementType: Cl Cl O O N C C C C C C C C C C C C C H H H H H H H H H H H H H H H H H
charge: -0.059034 -0.060488 -0.414853 -0.231380 -0.185556 0.465663 -0.388814 -0.386396 0.538245 -0.589690 -0.570290 -0.388763 -0.437920 -0.488977 -0.243625 -0.586605 -0.584740 0.188029 0.250386 0.249208 0.246617 0.248864 0.237190 0.233834 0.230477 0.234782 0.237960 0.264148 0.267918 0.223014 0.268469 0.293302 0.268190 0.293749 0.377087
chargesum: 0.00000
title: Mulliken charges with hydrogens summed into heavy atoms:
elementType: Cl Cl O O N C C C C C C C C C C C C C
charge: -0.059034 -0.060488 -0.037766 -0.231380 -0.185556 0.465663 0.110780 0.109085 0.538245 -0.352500 -0.105979 -0.153982 -0.199960 0.043090 -0.020611 -0.024834 -0.022801 0.188029
polarizability: 2.36375884e+02 -8.09185657e-01 1.86415225e+02 -1.15687389e+01 1.20036166e+01 1.14792704e+02
1716.lowfreq: -4.4263 -0.0012 -0.0008 -0.0001 1.9471 10.1685 14.7060 17.5128 23.9273
frequency: 13.9068 17.4625 23.8946 34.1884 46.4065 53.7345 73.5911 84.9624 108.2750 129.5786 173.4727 188.5406 204.0966 218.3204 226.2499 244.5619 260.1608 338.4113 384.4365 398.8749 417.6203 467.1768 504.7784 526.8989 535.1868 554.4611 591.7404 629.5081 639.3359 666.7506 691.1223 705.2654 721.3458 778.4559 781.5259 784.9752 789.2755 851.9019 870.0056 873.4947 901.2584 964.2633 968.6505 984.4189 997.8829 1011.9013 1023.1039 1035.3130 1037.3531 1051.1985 1078.9890 1102.2308 1122.6957 1152.8261 1169.2117 1194.1828 1222.1892 1223.6642 1239.9104 1255.9867 1258.8947 1270.7340 1280.5318 1293.6801 1303.3322 1326.6250 1352.2879 1353.7727 1367.7418 1379.0420 1386.3690 1438.9860 1453.0636 1457.2690 1460.6552 1475.3513 1481.8987 1492.7061 1504.5021 1588.5355 1618.0810 1666.7695 3000.4812 3011.2653 3012.6973 3017.9357 3045.5459 3063.5785 3063.8501 3068.8940 3074.0006 3074.4241 3123.3076 3137.9703 3143.2247 3148.1950 3149.1152 3164.7844 3510.9970
redmass: 7.1564 13.8209 9.2487 12.9051 6.5642 5.7986 2.5593 3.4229 2.4058 2.6594 6.5128 4.0366 5.4558 4.6676 6.2207 3.2238 5.0378 3.3431 3.7113 3.1073 4.0266 3.1965 1.7766 5.1301 4.4138 3.8621 4.7625 5.0094 1.3248 6.8406 4.2607 2.2872 3.8775 1.3310 1.1995 1.5371 1.1533 2.4511 2.3605 1.4710 3.0403 2.5251 1.3720 3.7383 1.4282 2.0243 2.8716 4.2010 3.7322 1.7171 2.4774 1.7406 1.3711 1.2217 1.4432 1.0980 2.3454 1.9322 1.4338 1.1603 1.1601 1.1662 1.3590 1.1915 1.7372 1.2911 1.2844 1.4416 1.7957 3.9670 2.1190 1.0873 2.1492 1.1344 1.2272 1.1211 1.1192 2.3336 1.1259 5.8955 6.1999 8.2486 1.0612 1.0601 1.0600 1.0608 1.0988 1.0583 1.0594 1.1002 1.1028 1.1033 1.0863 1.0902 1.0932 1.1115 1.1115 1.0964 1.0640
irintensity: 0.1884 1.1315 0.0947 1.4058 0.4951 0.8345 0.2370 0.9851 1.3703 2.4565 1.6165 4.1040 2.7611 0.4595 1.7183 13.9235 2.0208 9.3944 5.6257 0.4518 10.2601 14.6241 30.4990 11.9774 33.2911 15.6017 1.5498 4.1189 123.9779 52.3869 105.5606 22.9434 13.9440 9.9032 6.4012 41.3471 13.3936 7.1812 2.4753 5.3232 7.6478 8.2916 0.7826 22.9925 4.4201 31.8580 178.8300 0.4522 1.2929 18.3438 93.4132 2.4390 41.9125 9.4493 32.5246 8.4968 10.2996 25.3445 1.7803 14.2458 16.0244 2.3548 40.5198 9.1166 46.5278 11.9141 9.6800 42.3819 46.7618 6.3554 25.9720 29.0708 29.0404 6.4714 25.0553 18.5121 34.3393 93.0555 36.1950 39.7907 240.6259 218.9765 6.0544 18.1078 26.9481 12.8179 0.1377 8.7866 18.2774 12.8614 16.4535 11.9305 4.2502 27.0898 21.4011 11.4084 10.3122 18.6187 19.8002
temp: 298.150 k
press: 1.00000 atm
elementType: 17 17 8 8 7 6 6 6 6 6 6 6 6 6 6 6 6 6 1 1 1 1 1 1 1 1 1 1 1 1 1 1 1 1 1
symmnumber: 1
zpe: 731888.9 jmol-1
zpe.correction: 0.278762 hartree
zpe.thermalcorrener: 0.298067 hartree
zpe.thermalcorrenthalpy: 0.299011 hartree
zpe.thermalcorrgfe: 0.225416 hartree
zpe.sumelectzpe: -1629.544227 hartree
zpe.sumelectthermal: -1629.524923 hartree
zpe.sumelectthermalent: -1629.523978 hartree
zpe.sumelectthermalfe: -1629.597573 hartree
dipole: -0.2778 -0.7590 -1.3815
dipole: 1.6006
quadrupole: -130.3594 -128.2313 -125.9700
quadrupole: 4.3979 8.5349 0.4237
quadrupole: -2.1725 -0.0444 2.2169 4.3979 8.5349 0.4237
hfenergy: -1629.8229891 hartree
pointgroup: C01 [X(C13H17Cl2N1O2)]
dipole: -0.1048428 0.2734912 0.5574536 debye
polarizability: 236.4566426|-0.1586943|185.1161182|11.315249|15.2366144|116.0110523 unknown
InChI: InChI=1S/C13H17Cl2NO2/c14-6-8-16(9-7-15)12-3-1-2-11(10-12)4-5-13(17)18/h1-3,10,17H,4-9H2
charge 0 multiplicity 1
35 atoms
Cl 1.218452 -4.529216 -0.233595
Cl 6.121521 0.985789 0.070785
O  -5.649006 -0.477276 1.168025
O  -5.359373 -0.171676 -1.115607
N  2.250543 -0.514697 0.002075
C  1.194377 0.427831 0.054359
C  2.051259 -1.864534 -0.550075
C  3.599611 -0.179143 0.487392
C  -1.184851 1.018283 -0.340974
C  -0.12388 0.085107 -0.376365
C  -2.583828 0.603574 -0.777204
C  1.412451 1.754893 0.534821
C  -0.94402 2.329727 0.141071
C  -3.474335 0.253134 0.439779
C  0.351433 2.681408 0.574883
C  1.493395 -2.817741 0.52431
C  4.40802 0.550782 -0.602754
C  -4.883306 -0.137682 0.040128
H  1.373823 -1.840287 -1.421888
H  3.017794 -2.256244 -0.913679
H  4.12787 -1.107895 0.766649
H  3.549192 0.441366 1.399563
H  -0.341085 -0.920636 -0.751886
H  -3.0684 1.417007 -1.347516
H  -2.54222 -0.269045 -1.453515
H  2.402542 2.079025 0.868221
H  -1.755803 3.065844 0.163101
H  -3.036198 -0.576878 1.0260
H  -3.538934 1.107589 1.140339
H  0.548637 3.695328 0.941349
H  2.19882 -2.966963 1.355189
H  0.513944 -2.494399 0.904347
H  4.583709 -0.082741 -1.484857
H  3.948515 1.50449 -0.898388
H  -6.567769 -0.727225 0.875716
