program: Gaussian 09
title: 000247629
version: EM64L-G09RevD.01
frameworkgroup: C1[X(C18H28N2)]
method: RPBEPBE
basis: SDD
operation: Freq
keyword: #pfreq=noraman
keyword: PBEPBE/SDD
title: #p freq=noraman PBEPBE/SDD
converged: YES YES NO NO
title: Mulliken charges:
elementType: N N C C C C C C C C C C C C C C C C C C H H H H H H H H H H H H H H H H H H H H H H H H H H H H
charge: -0.220809 -0.220808 -0.367679 -0.367675 -0.396197 -0.396201 -0.397354 -0.397352 0.366714 0.366789 0.366781 0.366722 -0.432144 -0.432218 -0.432217 -0.432146 -0.805508 -0.805255 -0.805245 -0.805519 0.198673 0.198634 0.198658 0.198647 0.214378 0.214216 0.214355 0.214240 0.216296 0.216260 0.216299 0.216258 0.242557 0.242548 0.242549 0.242557 0.244065 0.221547 0.224513 0.221497 0.244038 0.224439 0.224435 0.244037 0.221499 0.224517 0.221544 0.244066
chargesum: 0.00000
title: Mulliken charges with hydrogens summed into heavy atoms:
elementType: N N C C C C C C C C C C C C C C C C C C
charge: -0.220809 -0.220808 0.029628 0.029631 0.032397 0.032394 0.035202 0.035204 0.366714 0.366789 0.366781 0.366722 -0.189587 -0.189670 -0.189668 -0.189589 -0.115384 -0.115281 -0.115275 -0.115391
polarizability: 2.51041399e+02 1.30832673e-02 2.18529030e+02 2.84597327e+01 -4.22022149e-03 1.42278714e+02
1716.lowfreq: -23.7219 -7.1942 -0.0010 -0.0007 0.0002 0.9153 3.1573 15.7295 29.5551
frequency: 3.1549 15.7295 29.5550 35.8481 57.8447 58.0173 72.6974 101.7177 116.6512 120.5694 125.0788 139.2123 143.4873 154.0400 156.7820 177.8888 183.1762 256.0581 262.6860 280.4222 281.0662 289.3482 292.0737 292.9477 370.3118 395.8424 457.1117 457.2846 470.5185 576.6669 579.9147 621.2923 621.2970 636.2328 638.9817 702.5885 702.6190 727.2847 738.9983 741.7359 755.4240 763.8574 764.5885 780.3356 832.4056 832.4477 859.2001 934.2713 953.5929 968.2445 968.3095 978.7231 1000.2248 1003.2397 1005.3550 1017.5820 1030.4920 1031.4012 1038.5850 1038.6563 1045.2823 1045.3671 1057.8123 1076.7534 1083.2472 1153.1350 1172.1487 1199.4604 1200.9758 1213.7364 1215.3022 1222.2092 1229.3656 1271.0807 1273.0149 1278.7747 1290.2848 1294.2536 1309.6962 1310.3413 1326.3666 1357.0189 1357.5827 1361.2605 1392.2910 1392.3677 1401.2736 1401.3354 1402.2799 1402.3909 1411.1371 1412.5215 1458.8495 1461.7709 1461.9197 1465.7965 1467.5420 1467.5937 1467.6227 1470.7163 1475.2199 1475.2605 1477.4738 1483.8306 1493.3643 1494.2742 1537.7467 1537.7818 1575.5258 1575.5319 2950.3836 2953.3836 2953.5257 2955.8865 2955.9885 2956.3797 2980.6290 2981.6111 2987.8352 2999.9138 3000.3264 3009.8354 3017.8719 3017.8789 3019.0172 3019.0227 3030.1568 3037.6148 3061.2410 3063.4811 3089.0167 3089.0428 3089.1532 3089.2519 3199.1131 3199.1221 3220.6142 3220.6272
redmass: 3.2907 3.9979 4.2444 3.3209 1.6607 3.9455 2.9571 2.8767 1.9248 2.4553 1.4223 1.1790 1.2890 1.1739 1.1940 2.9017 3.4827 4.3257 2.6536 2.8153 2.8930 2.7918 2.3690 2.3601 4.0879 3.5443 2.4284 2.4223 3.3278 4.2331 4.1741 3.1699 3.1705 4.8442 4.7329 3.3659 3.5105 1.0694 3.9784 1.1673 3.0278 1.2295 1.3347 1.2756 1.3331 1.3324 1.3979 2.2459 2.2931 1.6121 1.6006 1.3398 4.8425 4.2732 1.4978 1.4478 1.2198 1.2264 1.4196 1.4193 1.4874 1.4658 2.7876 2.2972 4.9571 2.1551 1.6821 4.4609 5.0067 1.4285 1.3914 1.2797 1.4540 1.4106 1.2876 1.1035 1.1116 1.1863 4.0820 4.0338 1.3385 1.3946 1.6173 1.4821 3.0780 3.0539 1.2348 1.2347 1.5057 1.4970 2.3064 2.3521 1.0847 1.0743 1.0957 1.0955 1.0584 1.0476 1.0543 1.0765 1.1108 1.1109 1.1252 1.1467 1.2097 1.1865 4.6164 4.6244 5.2939 5.2936 1.0586 1.0397 1.0397 1.0423 1.0396 1.0562 1.0595 1.0587 1.0980 1.0591 1.0589 1.1015 1.0978 1.0977 1.0978 1.0977 1.1018 1.1031 1.1054 1.1050 1.0945 1.0945 1.0944 1.0943 1.0923 1.0923 1.1040 1.1040
irintensity: 0.1342 0.7745 1.1916 0.0000 0.0000 0.0000 0.1423 0.6713 0.0000 0.0000 0.0085 0.0000 0.0333 0.2535 0.0000 8.4135 0.0000 0.0000 2.8479 0.0000 0.4576 0.0000 0.0000 0.4633 22.7435 3.0105 0.0000 0.7548 0.0000 0.0000 2.6146 0.0003 0.1165 5.6586 0.0000 0.0001 0.5430 9.3035 0.0000 0.0000 29.6933 0.0008 132.8742 0.9873 0.0001 0.0622 0.0000 0.5349 0.0000 0.8422 0.0000 7.6283 9.9602 0.0000 0.0000 4.6621 31.5577 0.0000 0.0000 0.7363 13.2197 0.0006 5.4104 0.0000 0.0000 0.0000 0.0105 2.7639 0.0000 0.0000 9.9366 12.6091 0.0000 2.9947 0.0000 0.0000 0.7132 0.0000 61.1856 0.0000 4.0999 0.0000 0.0000 53.4628 4.8725 0.0006 0.0021 21.8977 32.9168 0.0024 169.8236 0.0000 10.5652 0.0000 0.0000 17.1995 0.0001 1.5726 0.0000 32.9974 23.3784 0.0001 0.0000 15.0878 0.0001 31.1775 24.7193 0.0117 0.1565 8.0486 0.0000 0.0521 158.7916 46.8502 0.0159 67.4790 0.0003 28.0060 0.0000 0.0020 123.1057 9.5143 0.0602 0.0503 85.7541 43.3820 0.0000 20.7827 0.0001 127.2610 0.3674 11.7992 70.8536 0.0048 4.5508 15.7918 12.5790 1.2472
temp: 298.150 k
press: 1.00000 atm
elementType: 7 7 6 6 6 6 6 6 6 6 6 6 6 6 6 6 6 6 6 6 1 1 1 1 1 1 1 1 1 1 1 1 1 1 1 1 1 1 1 1 1 1 1 1 1 1 1 1
symmnumber: 1
zpe: 1101745.6 jmol-1
zpe.correction: 0.419633 hartree
zpe.thermalcorrener: 0.442648 hartree
zpe.thermalcorrenthalpy: 0.443592 hartree
zpe.thermalcorrgfe: 0.362284 hartree
zpe.sumelectzpe: -810.673653 hartree
zpe.sumelectthermal: -810.650637 hartree
zpe.sumelectthermalent: -810.649693 hartree
zpe.sumelectthermalfe: -810.731001 hartree
dipole: 0.0000 0.0007 0.0001
dipole: 0.0007
quadrupole: -161.5369 -112.3411 -126.6751
quadrupole: 0.0216 -3.7076 0.0057
quadrupole: -28.0192 21.1766 6.8426 0.0216 -3.7076 0.0057
hfenergy: -811.0932853 hartree
pointgroup: C01 [X(C18H28N2)]
dipole: 0.0000117 0.0002604 -0.0000234 debye
polarizability: 251.2036889|0.1463369|218.5284972|28.1469417|-0.2193821|142.1169569 unknown
InChI: InChI=1S/C18H28N2/c1-15-9-10-16(2)19(15)13-7-5-6-8-14-20-17(3)11-12-18(20)4/h9-12H,5-8,13-14H2,1-4H3
charge 0 multiplicity 1
48 atoms
N  4.451696 -0.004491 -0.374082
N  -4.451461 -0.017152 0.374133
C  0.56722 -0.0147 -0.524718
C  -0.566984 -0.007341 0.524721
C  1.974949 -0.00558 0.110209
C  -1.974718 -0.016709 -0.110193
C  3.100212 -0.010071 -0.953442
C  -3.099968 -0.011092 0.953467
C  5.17968 -1.152768 -0.003054
C  5.173977 1.149905 -0.01098
C  -5.1738 -1.171844 0.012095
C  -5.179397 1.130821 0.00207
C  6.372379 -0.716559 0.588212
C  6.368647 0.723652 0.583578
C  -6.368528 -0.746076 -0.582696
C  -6.372081 0.69413 -0.588872
C  4.687484 -2.549144 -0.268811
C  4.67517 2.542061 -0.286378
C  -4.675039 -2.563776 0.288704
C  -4.687134 2.527411 0.266567
H  0.458447 -0.909289 -1.173219
H  0.454462 0.866973 -1.190039
H  -0.454133 -0.888888 1.190189
H  -0.4583 0.88737 1.173073
H  2.095587 -0.887597 0.76967
H  2.090021 0.886977 0.756321
H  -2.095181 0.864788 -0.770386
H  -2.089977 -0.909775 -0.75556
H  2.994784 -0.902676 -1.597988
H  2.991749 0.874186 -1.608964
H  -2.994455 0.882152 1.597112
H  -2.991566 -0.894698 1.609877
H  7.156546 -1.368201 0.971787
H  7.149437 1.381809 0.962904
H  -7.1494 -1.404542 -0.961315
H  -7.156187 1.345457 -0.973103
H  5.417997 -3.271692 0.131537
H  3.712957 -2.76277 0.213752
H  4.57354 -2.762975 -1.350772
H  3.700201 2.754932 0.195625
H  5.402844 3.270772 0.107937
H  4.559164 2.74747 -1.369741
H  -4.558877 -2.768183 1.372238
H  -5.402828 -3.292803 -0.104817
H  -3.700162 -2.77717 -0.193256
H  -4.573315 2.742266 1.348341
H  -3.712524 2.740496 -0.216069
H  -5.417534 3.249636 -0.134567
