program: Gaussian 09
title: 000247603
version: EM64L-G09RevD.01
frameworkgroup: C1[X(C9H10O2)]
method: RPBEPBE
basis: SDD
operation: Freq
keyword: #pfreq=noraman
keyword: PBEPBE/SDD
title: #p freq=noraman PBEPBE/SDD
converged: YES YES NO NO
title: Mulliken charges:
elementType: O O C C C C C C C C C H H H H H H H H H H
charge: -0.453153 -0.449327 -0.144153 -0.216872 -0.583957 0.297831 0.253649 -0.404890 -0.415970 -0.227011 -0.225379 0.231428 0.224325 0.220690 0.239953 0.264173 0.240212 0.344546 0.352738 0.226407 0.224762
chargesum: 0.00000
title: Mulliken charges with hydrogens summed into heavy atoms:
elementType: O O C C C C C C C C C
charge: -0.108607 -0.096590 0.087275 0.007453 -0.123313 0.297831 0.253649 -0.140717 -0.175758 -0.000605 -0.000617
polarizability: 1.29782480e+02 2.10960757e+00 1.06020011e+02 -2.58093438e+00 3.53671084e+00 5.47245050e+01
1716.lowfreq: -5.7479 -0.0008 -0.0005 0.0004 0.9829 6.1959 78.3990 131.8192 192.7106
frequency: 78.3956 131.8158 192.7071 243.6498 250.7122 296.0835 346.3430 367.0988 411.5569 446.7998 477.4918 498.5090 517.7602 595.6062 634.5706 716.7876 752.6870 798.0996 840.2806 856.1566 882.3841 946.8653 987.4006 989.0189 1018.7273 1019.0227 1035.4561 1043.3387 1096.9508 1138.4935 1160.7277 1167.7023 1173.2183 1195.0797 1215.9353 1230.5538 1268.4479 1297.3751 1301.8426 1370.4177 1382.4334 1395.0492 1450.7444 1461.3891 1475.8320 1598.3250 1625.4611 2930.1650 2976.9907 2982.4447 3048.2779 3121.0883 3133.9164 3149.9971 3164.7979 3564.3600 3576.8794
redmass: 4.6373 4.2208 3.6540 3.5070 2.8346 1.2249 1.9483 1.6374 3.8369 3.9287 4.0779 2.8939 4.1459 5.5432 4.9172 3.8007 1.3245 3.2432 2.9194 2.3221 1.4124 1.4221 3.0666 1.4902 2.2213 2.1643 3.9890 4.1034 1.9959 1.2695 1.5203 1.2005 1.1995 1.4410 1.3562 1.5073 1.4792 1.3796 1.3826 1.7755 1.4925 4.7176 2.4931 1.1672 2.6166 7.0179 7.3635 1.0819 1.0803 1.0670 1.1005 1.0859 1.0901 1.0948 1.0994 1.0658 1.0664
irintensity: 1.2933 0.8030 7.3315 12.5484 13.2927 116.2013 35.4496 152.0431 6.0947 12.2998 3.5898 3.0242 1.9567 3.2905 16.3021 0.6684 74.5269 20.2092 3.3753 14.7372 0.3043 4.2840 69.5799 15.5881 2.3663 0.9618 86.5157 34.4749 16.8679 6.3099 53.2153 1.7354 25.8785 16.2845 7.8960 0.8769 18.3806 16.5082 2.9030 2.9799 5.7981 5.4248 10.0701 12.7568 11.3807 0.7566 1.4820 24.3325 21.5493 49.8262 29.6964 1.7048 14.6684 26.6675 21.6416 6.4759 6.7386
temp: 298.150 k
press: 1.00000 atm
elementType: 8 8 6 6 6 6 6 6 6 6 6 1 1 1 1 1 1 1 1 1 1
symmnumber: 1
zpe: 442799.1 jmol-1
zpe.correction: 0.168653 hartree
zpe.thermalcorrener: 0.178127 hartree
zpe.thermalcorrenthalpy: 0.179071 hartree
zpe.thermalcorrgfe: 0.134302 hartree
zpe.sumelectzpe: -498.582798 hartree
zpe.sumelectthermal: -498.573324 hartree
zpe.sumelectthermalent: -498.572380 hartree
zpe.sumelectthermalfe: -498.617149 hartree
dipole: -0.8082 -2.2181 -0.3317
dipole: 2.3839
quadrupole: -55.5075 -59.5922 -67.9109
quadrupole: 2.8601 2.9360 3.8700
quadrupole: 5.4960 1.4114 -6.9074 2.8601 2.9360 3.8700
hfenergy: -498.7514511 hartree
pointgroup: C01 [X(C9H10O2)]
dipole: 0.3236206 0.8517099 -0.2225705 debye
dipolederiv: -1.0101047 0.0040497 -0.0726582 0.0163654 -0.3698055 -0.2220168 -0.1731021 -0.2079536 -0.3356514 -0.3255509 0.1660573 0.1584436 0.2679215 -0.825092 0.047394 0.2150903 -0.0382641 -0.4864704 0.8438772 0.0427142 0.0979602 0.0532912 0.1189091 0.1320398 0.0783647 0.1533807 0.267387 0.3555971 -0.2134539 -0.0530781 -0.3106987 0.6452256 0.0501617 -0.1338656 0.0818707 0.3703762 -0.2154925 -0.0036538 0.0011036 0.0435662 -0.0131687 -0.0501866 -0.038244 -0.0662292 0.1377934 0.0421479 -0.0015374 0.0364128 -0.1551094 -0.1393968 -0.0145195 0.136911 -0.033275 -0.0388486 0.1323444 0.133895 -0.0091952 0.2634483 0.0406688 0.0026871 0.0449108 0.0192777 -0.0521774 -0.0633041 -0.0262595 0.0063683 0.0044118 0.1019565 -0.0444398 -0.0390474 -0.0108702 -0.1290982 -0.1114421 -0.0699217 0.0235224 -0.0757594 0.0795556 -0.0556166 0.0135537 -0.0579118 -0.145687 0.0096353 0.0725335 0.0059491 0.1129879 -0.0131925 -0.0200036 0.0003668 -0.023064 -0.1641402 0.0484092 -0.0229432 0.0300015 -0.0761093 -0.024639 -0.0358967 0.032623 -0.0360014 -0.1493731 -0.0273811 -0.0045844 0.0005384 0.0197747 0.0273068 -0.0579723 -0.008594 -0.0567731 -0.1625664 -0.0501717 0.0337291 -0.0627017 0.0779405 -0.0214289 -0.0293725 -0.0344511 -0.0378581 -0.1484596 0.0199388 -0.0148591 0.0085628 -0.027055 -0.0576001 0.1040866 0.058915 0.156779 -0.0249011 0.0044606 -0.0579264 -0.0317341 -0.0392651 0.0151868 -0.0598847 -0.039443 -0.1119634 -0.0543099 0.1006685 0.0260517 -0.0106466 0.0057601 -0.0548129 0.04819 -0.010343 0.0418759 0.1449746 0.079909 0.0082292 -0.0072686 0.0402159 -0.1038143 0.0594982 -0.0145968 0.0600086 0.1407525 0.3119039 -0.0573921 0.0104823 -0.1376644 0.1792311 0.1538568 0.0428346 0.1603567 0.2063247 0.0436502 0.025403 -0.0951235 -0.0405405 0.3424645 -0.0550161 -0.0904927 -0.0395664 0.3207643 -0.0680529 -0.1048187 0.0024915 -0.1110835 0.0076855 0.0203594 0.0027605 0.0174022 0.1556434 -0.121042 0.0646875 -0.0394307 0.0676021 0.0647604 0.0266517 -0.0441504 0.0287788 0.1476674 unknown
polarizability: 129.487724|2.8469833|104.4495735|5.0821022|-9.4525683|56.5896988 unknown
InChI: InChI=1S/C9H10O2/c10-8-5-6-3-1-2-4-7(6)9(8)11/h1-4,8-11H,5H2
charge 0 multiplicity 1
21 atoms
O  3.282459 0.620731 0.304239
O  1.669104 -2.087132 -0.109256
C  1.969368 0.416723 -0.318916
C  1.28594 -0.771541 0.403395
C  0.964521 1.599996 -0.170392
C  -0.187343 -0.49373 0.179261
C  -0.379021 0.877438 -0.134919
C  -1.274272 -1.38083 0.266622
C  -1.675556 1.377937 -0.362194
C  -2.578845 -0.878006 0.035669
C  -2.777321 0.490262 -0.272557
H  2.079655 0.147247 -1.391015
H  1.543241 -0.693031 1.485006
H  1.040358 2.346085 -0.982216
H  1.163479 2.119676 0.788811
H  -1.104939 -2.43949 0.487444
H  -1.835619 2.433244 -0.612501
H  3.791728 1.300238 -0.203576
H  2.623176 -2.23567 0.113135
H  -3.44103 -1.552295 0.089675
H  -3.792083 0.863748 -0.452018
