program: Gaussian 09
title: 000247600
version: EM64L-G09RevD.01
frameworkgroup: C1[X(C12H12)]
method: RPBEPBE
basis: SDD
operation: Freq
keyword: #p
keyword: freq=noraman
keyword: PBEPBE/SDD
title: #p freq=noraman PBEPBE/SDD
converged: YES YES NO YES
title: Mulliken charges:
elementType: C C C C C C C C C C C C H H H H H H H H H H H H
charge: -0.263443 0.297472 0.295735 -0.480515 -0.256734 -0.419410 -0.431469 -0.414924 -0.028796 -0.242676 -0.230315 -0.588098 0.235417 0.236146 0.212166 0.252428 0.249888 0.238174 0.242799 0.212096 0.223645 0.223702 0.215225 0.221488
chargesum: 0.00000
title: Mulliken charges with hydrogens summed into heavy atoms:
elementType: C C C C C C C C C C C C
charge: -0.028026 0.297472 0.295735 -0.032203 -0.004307 -0.169522 -0.193295 -0.172126 0.183300 -0.019031 -0.006613 -0.151384
polarizability: 1.81126544e+02 -1.23819791e+01 1.20501405e+02 7.95814616e+00 7.32529203e+00 7.32540956e+01
1716.lowfreq: -10.2107 -0.0010 -0.0006 0.0001 4.9098 8.3950 58.1919 65.2724 103.6589
frequency: 58.1214 65.2614 103.6375 141.7233 229.0030 261.9966 278.8061 400.5265 405.2237 438.5497 517.6403 538.4515 567.6295 610.0948 636.1280 720.1507 732.2954 749.8429 790.7320 828.5162 851.4263 874.7549 890.9740 919.5052 940.3953 945.3751 951.8746 982.8589 989.6265 1006.0775 1017.8591 1057.2608 1064.5734 1084.9576 1116.5105 1162.7018 1170.2998 1186.7751 1208.5520 1231.9492 1259.4785 1286.0594 1288.4400 1302.4585 1334.8758 1403.3700 1425.2479 1446.4694 1457.9338 1458.9895 1555.6497 1598.4143 1618.6880 1658.5257 2946.2962 2968.9398 3047.5853 3072.6909 3092.3495 3117.1531 3126.0701 3140.3311 3159.3858 3160.8612 3193.4389 3195.6910
redmass: 3.6619 3.0133 2.4794 3.2484 3.3315 3.2853 3.0236 2.9423 2.3122 3.0289 2.4582 5.7332 3.1366 4.1176 1.7559 4.4508 2.1739 1.2806 1.7622 2.6507 4.6666 1.4394 2.4860 1.6064 1.3412 1.3370 1.3816 1.3221 1.7506 1.3354 2.1465 2.4648 1.5670 1.5452 1.3300 1.3261 1.2140 1.8718 1.5990 1.9638 1.4115 1.4040 1.2840 1.4724 2.1192 4.3649 1.1757 2.4647 3.3405 1.1063 5.7477 6.7042 7.3123 4.7348 1.0807 1.0634 1.0954 1.0810 1.0737 1.0863 1.0885 1.0943 1.0990 1.0892 1.1053 1.1146
irintensity: 0.0269 0.0343 0.4542 0.0273 4.4015 0.3403 1.8909 1.8036 1.1618 10.1071 3.9655 2.9924 2.1823 6.2836 18.1581 4.6337 29.8999 22.7183 83.3090 0.3824 2.3434 1.5815 7.1358 6.9082 1.0232 75.1507 8.9631 0.1675 14.3258 18.0628 5.9043 3.0154 5.1240 7.7608 2.3810 0.9382 0.2543 3.9972 1.4901 0.9592 3.8464 0.6782 2.5329 0.5670 3.3657 2.6132 4.5561 5.9134 18.2891 11.8479 0.6415 0.5267 1.4732 16.9911 13.1378 21.9308 5.7815 37.2557 7.5104 5.5023 4.4477 33.3227 34.2923 6.8970 14.6305 30.5140
temp: 298.150 k
press: 1.00000 atm
elementType: 6 6 6 6 6 6 6 6 6 6 6 6 1 1 1 1 1 1 1 1 1 1 1 1
symmnumber: 1
zpe: 520638.9 jmol-1
zpe.correction: 0.198301 hartree
zpe.thermalcorrener: 0.208606 hartree
zpe.thermalcorrenthalpy: 0.209550 hartree
zpe.thermalcorrgfe: 0.161892 hartree
zpe.sumelectzpe: -463.592740 hartree
zpe.sumelectthermal: -463.582435 hartree
zpe.sumelectthermalent: -463.581490 hartree
zpe.sumelectthermalfe: -463.629149 hartree
dipole: -0.4515 -0.2079 -0.2104
dipole: 0.5398
quadrupole: -66.2677 -66.5717 -73.3436
quadrupole: -0.5440 3.1110 2.4604
quadrupole: 2.4600 2.1560 -4.6160 -0.5440 3.1110 2.4604
hfenergy: -463.7910408 hartree
pointgroup: C01 [X(C12H12)]
dipole: -0.1772844 -0.0818182 -0.0834928 debye
dipolederiv: -0.1804034 -0.0228174 -0.0274107 -0.088387 -0.0276921 -0.0003789 -0.1143937 -0.0088881 0.2023344 0.2228108 0.007155 0.0314218 0.0524251 -0.1941772 0.0340179 0.1897178 0.0079443 -0.0691355 0.1264062 -0.1261027 0.0134221 -0.2729304 -0.0119599 -0.0536959 -0.0312344 -0.0349184 0.0350221 0.0534088 0.0520068 -0.0113504 0.1428716 0.1535982 0.0136213 -0.0941977 -0.033672 0.0855079 -0.1271302 0.078541 0.0557127 0.2029217 0.0272036 0.0522864 0.1103754 0.1062973 -0.218447 -0.1465428 -0.0583127 0.0349125 -0.0956196 0.1790242 0.0538154 0.0077247 0.0401259 -0.1826748 -0.0739684 0.0153815 0.0470586 0.0444726 0.1149017 0.0367704 0.0273458 0.0401919 -0.1434588 -0.0801859 0.0804227 0.0469985 0.0931062 0.0721555 0.0542907 0.0290932 0.0482429 -0.1556755 0.3035213 -0.0601584 0.0188641 -0.186769 -0.1736194 0.1119591 0.2034727 0.1058299 0.117391 -0.0614818 0.0015631 0.02157 -0.0373433 0.0338709 0.0166976 0.020308 0.0257105 -0.1695659 0.1025125 -0.0343937 0.0664889 0.0203815 -0.0768089 0.0243923 0.0685244 0.0042273 -0.1468854 -0.2011468 -0.0669693 0.128291 -0.036144 -0.35288 0.0919106 0.1373423 0.0943252 0.0127655 0.0692205 0.0097639 -0.0677681 -0.0145065 0.0391044 -0.0626625 -0.0612356 -0.0298799 -0.0895906 0.0243612 -0.0114011 -0.006899 -0.0022647 0.0639781 -0.0635254 -0.025197 -0.0107688 -0.1145414 -0.0202149 0.0693715 0.0207097 0.0051839 -0.1324881 -0.0079793 -0.0135034 -0.0295127 0.0863201 -0.0176443 0.0990415 -0.0352398 0.0845563 0.0415164 -0.0078446 -0.0291759 -0.0120119 0.1518991 0.0672452 -0.0408947 -0.0235863 0.0045332 -0.1014829 -0.0311254 -0.0380205 -0.0549687 0.1676229 0.0482772 -0.1024474 -0.0437174 -0.0712526 -0.0608328 -0.0394871 -0.0360265 -0.0460427 0.131699 0.0381278 -0.0606407 -0.0341118 -0.0944134 -0.0681741 -0.0515055 -0.0434351 -0.0460891 0.1485419 0.030704 0.0176108 -0.017632 0.032492 0.1236336 -0.0657226 -0.093818 -0.064775 -0.1280535 0.011564 0.1017747 -0.0173985 0.116075 -0.0737031 -0.0080682 -0.020653 -0.0070264 0.1571502 -0.1441329 0.0091989 -0.0672475 0.0068476 0.0886242 -0.0082439 -0.0714143 -0.0072102 0.1420555 -0.128144 0.0366819 -0.0588449 0.0755299 0.180987 -0.0273847 -0.0775377 -0.0197265 0.0668854 0.0828359 0.005625 -0.0742439 0.0182338 0.1552208 -0.0621377 -0.0440616 -0.0674051 -0.0871667 unknown
polarizability: 181.2074314|-12.2253479|120.3000021|7.8941044|7.6999208|73.374611 unknown
InChI: InChI=1S/C12H12/c1-2-5-10-8-9-11-6-3-4-7-12(10)11/h2-4,6-10H,1,5H2
charge 0 multiplicity 1
24 atoms
C  -0.91874 -0.031262 -0.6060
C  0.548721 -0.305035 -0.285339
C  1.193628 0.928353 0.042325
C  -1.923675 -0.850185 0.270294
C  -1.020057 1.479015 -0.411668
C  0.191247 2.007656 -0.045312
C  1.268024 -1.511184 -0.278324
C  2.566572 0.955867 0.374851
C  -3.364787 -0.643993 -0.145554
C  2.647175 -1.484958 0.05839
C  3.288042 -0.262753 0.37989
C  -4.357149 -0.192888 0.66206
H  -1.123452 -0.282924 -1.670681
H  -1.783012 -0.579589 1.332668
H  -1.662627 -1.924135 0.169155
H  -1.95605 2.026933 -0.545111
H  0.399156 3.061513 0.158956
H  0.782621 -2.462231 -0.528962
H  3.066898 1.89895 0.622792
H  -3.599492 -0.891277 -1.193959
H  3.223087 -2.417238 0.069696
H  4.353894 -0.264147 0.635517
H  -5.38517 -0.075472 0.300825
H  -4.167355 0.070181 1.710192
