program: Gaussian 09
title: 000247592
version: EM64L-G09RevD.01
frameworkgroup: C1[X(C10H9ClO4)]
method: RPBEPBE
basis: SDD
operation: Freq
keyword: #p
keyword: freq=noraman
keyword: PBEPBE/SDD
title: #p freq=noraman PBEPBE/SDD
converged: YES YES NO NO
title: Mulliken charges:
elementType: Cl O O O O C C C C C C C C C C H H H H H H H H H
charge: -0.023556 -0.241177 -0.288060 -0.204546 -0.241666 0.383710 0.094222 -0.276187 -0.337271 -0.223258 -0.207690 0.131691 0.186250 -0.500306 -0.499745 0.282355 0.264325 0.242815 0.244378 0.254225 0.231181 0.247716 0.235383 0.245210
chargesum: 0.00000
title: Mulliken charges with hydrogens summed into heavy atoms:
elementType: Cl O O O O C C C C C C C C C C
charge: -0.023556 -0.241177 -0.288060 -0.204546 -0.241666 0.383710 0.094222 -0.276187 -0.054916 0.041067 0.035125 0.131691 0.186250 0.229478 0.228565
polarizability: 1.67695484e+02 1.19087623e+00 1.53447327e+02 1.62202518e+00 4.74703026e+00 7.32520209e+01
1716.lowfreq: -6.6489 -0.0017 -0.0013 -0.0011 4.0437 9.6407 25.1877 52.5075 66.1871
frequency: 25.1592 52.4924 66.1852 90.5240 101.8878 118.1574 125.4732 138.9286 160.1896 198.4415 205.9148 249.8669 266.0672 282.5274 322.2883 366.1887 396.3677 408.0410 490.3815 507.6853 560.0103 671.6628 690.4496 695.0893 704.8819 748.0870 779.9128 794.3689 811.7903 911.9325 931.2403 936.0602 993.6103 1037.9854 1079.5315 1097.0673 1111.2591 1115.3806 1149.4274 1152.4401 1153.2392 1196.8049 1236.3517 1255.6942 1371.7103 1415.7163 1422.0518 1427.5741 1447.0561 1451.9243 1452.7197 1462.5624 1463.3603 1565.1185 1596.5081 1623.5968 1636.4854 3006.5661 3006.7999 3109.4823 3112.0267 3152.1495 3152.2967 3152.5520 3174.6704 3190.2459
redmass: 5.8251 6.0955 3.4196 1.1795 3.1623 1.2001 4.5448 6.6778 5.9827 5.6339 4.8572 6.1626 6.4480 5.5638 4.8704 5.9731 9.4200 7.1188 5.4813 7.7615 3.8711 6.5469 7.9752 8.5752 7.5325 2.7705 3.9958 6.9161 2.0311 8.2115 1.3873 9.1461 1.3517 5.6266 4.1264 2.6246 1.2956 1.2627 1.4580 1.4816 1.6849 1.4884 4.4020 2.7282 11.2497 1.2931 1.4226 1.7132 2.9445 1.0493 1.0507 1.0519 1.0519 7.3773 7.5926 10.0319 10.7519 1.0291 1.0294 1.1047 1.1050 1.1050 1.0942 1.0987 1.0946 1.0970
irintensity: 1.8369 0.3571 2.6249 1.4311 3.4328 0.2521 2.6252 0.5220 0.4573 3.6089 2.6652 1.9184 9.4431 5.4490 26.9517 5.7923 7.3992 1.7536 6.6251 10.4046 2.4210 3.4728 38.0572 10.3210 9.7905 57.7473 3.6793 28.9630 26.5093 6.5824 0.4765 30.6636 1.1371 95.8131 31.8529 95.8729 3.4732 0.0703 12.5539 29.2494 138.9988 77.4180 214.6455 246.4359 2.9013 30.3544 39.5847 3.3757 23.8467 15.0057 12.9483 8.3493 12.2071 27.7003 29.1797 151.1634 172.7791 28.3561 38.1021 23.1714 17.4557 15.6318 2.1082 18.6525 2.8490 4.2830
temp: 298.150 k
press: 1.00000 atm
elementType: 17 8 8 8 8 6 6 6 6 6 6 6 6 6 6 1 1 1 1 1 1 1 1 1
symmnumber: 1
zpe: 447285.0 jmol-1
zpe.correction: 0.170362 hartree
zpe.thermalcorrener: 0.185660 hartree
zpe.thermalcorrenthalpy: 0.186604 hartree
zpe.thermalcorrgfe: 0.126215 hartree
zpe.sumelectzpe: -1146.316281 hartree
zpe.sumelectthermal: -1146.300983 hartree
zpe.sumelectthermalent: -1146.300039 hartree
zpe.sumelectthermalfe: -1146.360428 hartree
dipole: -2.6966 -2.1909 -2.0379
dipole: 4.0280
quadrupole: -79.4380 -77.6219 -99.3897
quadrupole: -0.2100 -1.9218 -4.6484
quadrupole: 6.0452 7.8613 -13.9065 -0.2100 -1.9218 -4.6484
hfenergy: -1146.486643 hartree
pointgroup: C01 [X(C10H9Cl1O4)]
dipole: -1.0103512 0.907109 0.8171265 debye
dipolederiv: -0.6892076 0.1652224 0.044768 0.2360265 -0.1785751 -0.0174554 0.0405545 -0.0175634 -0.0450513 -0.3155418 0.1011184 -0.0394245 0.0985596 -1.0991059 0.3590176 -0.0830097 0.5742547 -0.8721654 -1.6608876 0.0891573 0.0651797 0.3205499 -0.511832 -0.0307885 0.1039538 -0.0267626 -0.2991762 -0.3447995 0.0792692 0.0586174 0.0722812 -0.6813508 -0.2393071 0.0355411 0.1186129 -0.87267 -0.7667291 -0.0708032 0.0053906 0.0643184 -0.9143144 -0.0538756 0.0285345 -0.0466396 -0.2807607 -0.1446454 0.1796644 0.0274082 -0.0199317 -0.1246194 0.0201104 0.0058681 -0.0102264 -0.053596 -0.4048559 -0.2605267 0.003731 -0.3170581 -0.1146389 -0.0050483 -0.0206301 0.0209532 0.0145088 1.0320196 -0.3135014 -0.0827091 -0.4740839 0.0426659 0.0237448 -0.0840034 0.0294158 -0.0510477 0.0070051 -0.047288 -0.0100445 0.1108585 -0.0905877 -0.0003747 0.0032433 0.0160628 -0.1065472 -0.167882 0.0528692 0.0100146 0.156892 -0.0165449 0.0011215 0.0142357 0.0099725 -0.0765251 -0.0889211 0.0215539 -0.0009856 0.0184141 0.1472839 0.0261238 0.0010327 0.0237658 -0.1423154 0.4819116 -0.2025018 -0.0451512 -0.0903162 1.3221323 -0.0864018 0.0391208 -0.6157826 1.4861567 1.9695578 0.1163656 -0.0633396 -0.231286 1.2056246 0.0942724 -0.1043416 0.0741129 0.2431649 0.2471222 -0.0359627 0.0179513 -0.0554601 0.6428187 -0.1554403 0.00701 -0.0862391 0.2477412 0.7608085 0.0459067 -0.0155577 0.1616926 0.2303891 -0.0116722 -0.0090556 -0.0068593 0.2725345 0.0369983 0.0629199 0.0113722 0.0648094 0.0903559 -0.0088701 0.0102914 -0.0112948 0.1592126 0.0057382 -0.0692775 0.0000581 -0.0514096 0.0613814 -0.0066314 0.0023179 -0.0103859 0.159397 0.0692366 0.0151004 0.0051205 0.0019359 -0.0960765 -0.0231747 0.0046837 -0.0247851 0.1562692 -0.0428248 0.0730562 0.0652506 0.0224636 -0.0158931 0.0282043 0.0989249 -0.0652014 0.0582142 -0.035287 -0.0744842 -0.0583163 -0.0187918 -0.0004981 0.028981 -0.0739149 -0.0562669 0.0689739 0.1141293 0.0052928 -0.0093468 0.005491 0.0329033 0.048353 -0.0184037 0.1077826 -0.0905992 -0.0033591 -0.0042128 0.0244754 -0.1032129 0.0530811 -0.0799134 -0.0396072 -0.0738749 -0.0631532 -0.0555002 0.0629922 0.0140158 0.1281419 -0.002139 -0.0174219 0.0206026 -0.0146703 0.1205433 -0.0040862 0.0080695 -0.0284781 -0.1008844 0.0175397 0.1064464 0.0170513 0.091619 -0.033109 unknown
polarizability: 167.4008604|-1.4780605|153.6980466|-4.8433959|2.9297119|73.2959245 unknown
InChI: InChI=1S/C10H9ClO4/c1-14-9(12)6-4-3-5-7(11)8(6)10(13)15-2/h3-5H,1-2H3
charge 0 multiplicity 1
24 atoms
Cl 3.516945 0.187254 -0.174814
O  0.895591 -2.020153 0.938241
O  -2.944185 0.703487 0.175887
O  0.960194 -1.910032 -1.3933
O  -1.821703 -1.317155 -0.083332
C  0.719392 0.133954 -0.064239
C  -0.551632 0.77031 0.055771
C  1.869132 0.950701 -0.04016
C  -0.636713 2.178972 0.190709
C  1.799636 2.350317 0.096548
C  0.532704 2.964044 0.209897
C  0.849384 -1.358882 -0.278359
C  -1.789072 -0.068643 0.038928
C  0.93925 -3.500668 0.849904
C  -4.21783 -0.055014 0.16226
H  -1.623947 2.63759 0.279647
H  2.718409 2.943209 0.114433
H  0.466373 4.051475 0.313448
H  1.823416 -3.8237 0.27544
H  0.022327 -3.862613 0.355864
H  0.993528 -3.841391 1.892944
H  -4.323508 -0.603354 -0.788635
H  -4.999612 0.709257 0.27091
H  -4.241578 -0.772765 0.999207
