program: Gaussian 09
title: 000247611
version: EM64L-G09RevD.01
frameworkgroup: C1[X(C13H12Cl2N2O3S)]
method: RPBEPBE
basis: SDD
operation: Freq
keyword: #p
keyword: freq=noraman
keyword: PBEPBE/SDD
title: #p freq=noraman PBEPBE/SDD
converged: YES YES NO NO
title: Mulliken charges:
elementType: Cl Cl S O O O N N C C C C C C C C C C C C C H H H H H H H H H H H H
charge: 0.026682 0.020267 1.000586 -0.359351 -0.480592 -0.535348 0.048723 0.156177 -0.063007 -0.482551 0.360821 -0.226831 -0.225806 0.159600 0.453624 -0.360434 -0.363245 -0.275561 -0.801166 -0.795267 -0.387666 0.267737 0.267286 0.291291 0.284561 0.254516 0.249424 0.265076 0.234471 0.299149 0.230615 0.252543 0.233677
chargesum: 0.00000
title: Mulliken charges with hydrogens summed into heavy atoms:
elementType: Cl Cl S O O O N N C C C C C C C C C C C C C
charge: 0.026682 0.020267 1.000586 -0.359351 -0.480592 -0.535348 0.048723 0.156177 -0.063007 0.052471 0.360821 0.064460 0.058754 0.159600 0.453624 -0.105919 -0.113821 -0.275561 -0.002470 -0.078431 -0.387666
polarizability: 2.10656524e+02 3.13701417e+01 2.26387685e+02 -3.10840150e+01 1.60280139e+01 1.73807217e+02
1716.lowfreq: -10.2442 -3.0966 -0.0007 0.0008 0.0022 7.4862 10.3252 22.3179 28.7594
frequency: 10.1551 22.2885 28.2312 44.3825 47.5000 61.7567 94.9152 124.0344 130.5143 147.6023 155.3294 183.6182 187.4206 197.1552 211.6949 229.0883 247.1667 252.9823 290.7675 303.9298 307.5114 355.4881 365.7358 377.1419 393.1397 405.0411 425.3193 465.6616 472.4887 512.0518 516.2985 535.3583 563.1115 586.3134 620.0692 629.2482 697.3345 700.7412 764.6111 776.5172 809.6549 823.3942 825.8051 843.6888 870.6183 898.8585 962.3129 963.8558 969.9979 986.0642 989.1169 991.3328 994.1400 1048.3577 1050.3442 1051.6857 1121.0799 1122.5021 1185.9655 1197.4225 1220.1642 1228.5364 1260.7116 1297.9035 1301.2774 1333.0310 1340.5572 1382.1888 1393.0936 1397.0364 1400.2130 1428.0650 1460.0155 1469.3671 1470.2973 1473.3013 1475.0755 1477.6926 1524.4739 1591.1256 1592.9272 2981.9914 2983.8449 3010.4749 3063.0567 3067.3487 3080.7147 3096.9362 3126.9640 3141.8287 3143.5032 3165.3530 3169.5332
redmass: 7.1701 7.9245 6.2943 1.0676 4.2943 7.5378 6.0046 8.6533 5.9215 7.8107 8.1863 4.7778 1.2640 14.1042 4.5275 8.7638 6.3342 4.7968 5.3638 4.5774 2.6824 6.9368 5.0100 7.9840 6.2193 2.8892 9.7663 5.0730 5.5854 4.6191 5.1803 5.3873 4.9744 6.2413 6.9644 7.5723 6.9497 3.5785 7.0332 4.8416 8.7539 1.8095 3.8694 1.2510 5.2436 9.1636 2.6728 1.3181 4.3637 1.4097 5.0808 1.9988 1.6130 2.3572 1.6253 1.5971 1.2988 3.6527 1.1432 2.3197 2.9963 1.9023 4.7847 1.2761 7.1652 1.2388 9.1064 5.9059 3.0076 1.2499 1.2204 1.1362 1.2143 2.1062 1.1574 1.1258 1.0681 4.8175 4.4195 6.0061 6.8008 1.0395 1.0391 1.0593 1.0966 1.0946 1.1029 1.1002 1.0979 1.0891 1.0895 1.0957 1.0969
irintensity: 1.6444 2.0742 0.1785 0.6045 0.1134 0.5357 0.7412 3.1419 0.4177 0.3642 3.2710 1.4058 1.0169 0.7688 2.0316 11.5775 1.2594 5.9803 2.9306 0.7602 5.5716 4.1144 2.6704 3.4363 4.0296 0.3149 58.6993 40.1542 11.0441 89.9593 45.7607 3.1627 1.7295 28.7835 0.3740 8.5148 14.6722 3.2371 10.0494 4.6871 76.2795 95.6241 35.2016 1.9948 32.6626 54.9338 31.3102 3.8256 94.2095 0.3194 2.4425 43.9779 2.7836 26.9886 13.5822 6.9984 10.7602 67.5686 5.7831 40.3155 5.1996 35.5522 6.9228 4.2204 70.4441 14.2655 118.0268 0.1716 9.0882 37.0102 21.8286 37.8155 73.3419 12.9146 16.5824 24.1046 15.3985 227.1318 161.6934 16.9253 1.7129 7.7590 14.2974 7.0331 3.3695 17.5864 8.1789 12.8563 4.8775 6.6567 5.3754 0.9528 5.4102
temp: 298.150 k
press: 1.00000 atm
elementType: 17 17 16 8 8 8 7 7 6 6 6 6 6 6 6 6 6 6 6 6 6 1 1 1 1 1 1 1 1 1 1 1 1
symmnumber: 1
zpe: 596305.6 jmol-1
zpe.correction: 0.227121 hartree
zpe.thermalcorrener: 0.248686 hartree
zpe.thermalcorrenthalpy: 0.249630 hartree
zpe.thermalcorrgfe: 0.173179 hartree
zpe.sumelectzpe: -2154.225145 hartree
zpe.sumelectthermal: -2154.203580 hartree
zpe.sumelectthermalent: -2154.202636 hartree
zpe.sumelectthermalfe: -2154.279088 hartree
dipole: 0.9922 2.1364 0.0276
dipole: 2.3557
quadrupole: -169.3527 -117.6450 -149.2911
quadrupole: -13.6622 -5.7456 -1.3707
quadrupole: -23.9231 27.7845 -3.8615 -13.6622 -5.7456 -1.3707
hfenergy: -2154.4522663 hartree
pointgroup: C01 [X(C13H12Cl2N2O3S1)]
dipole: -0.384265 -0.8432791 0.0142125 debye
polarizability: 180.9628415|17.1249789|245.7452639|31.8593383|-17.1360707|184.1433218 unknown
InChI: InChI=1S/C13H12Cl2N2O3S/c1-8-3-5-10(6-4-8)21(18,19)20-7-11-9(2)16-13(15)17-12(11)14/h3-6H,7H2,1-2H3
charge 0 multiplicity 1
33 atoms
Cl 0.866397 -0.328889 -2.811951
Cl 1.460672 -3.851984 1.179043
S  -1.293322 2.436511 0.274763
O  -0.002722 2.232002 -1.106724
O  -2.247098 3.618103 -0.261066
O  -0.493756 2.541982 1.687537
N  1.902023 -1.218486 1.538084
N  1.240744 -1.918864 -0.679756
C  -2.182697 0.787442 0.18565
C  1.361102 1.904779 -0.63302
C  1.500254 0.462331 -0.19205
C  -1.834083 -0.207858 1.11286
C  -3.159433 0.622896 -0.808884
C  1.900468 0.098523 1.135138
C  -3.493148 -1.676683 0.026493
C  -2.506707 -1.445048 1.02283
C  -3.813975 -0.626167 -0.874641
C  1.232286 -0.628833 -1.060107
C  2.334751 1.107762 2.167589
C  -4.174409 -3.02645 -0.08413
C  1.544199 -2.132674 0.619164
H  1.666536 2.59934 0.16763
H  1.960851 2.111677 -1.539318
H  -1.090565 -0.017776 1.893204
H  -3.407088 1.437753 -1.495927
H  -2.259115 -2.239178 1.735859
H  -4.581852 -0.785983 -1.639582
H  2.606533 0.579163 3.09282
H  3.208878 1.690189 1.822804
H  1.517574 1.822531 2.37962
H  -5.170019 -2.943784 -0.552281
H  -3.571518 -3.714349 -0.707732
H  -4.29556 -3.503178 0.903779
