program: Gaussian 09
title: 000247594
version: EM64L-G09RevD.01
frameworkgroup: C1[X(C15H13ClO)]
method: RPBEPBE
basis: SDD
operation: Freq
keyword: #p
keyword: freq=noraman
keyword: PBEPBE/SDD
title: #p freq=noraman PBEPBE/SDD
converged: YES YES NO NO
title: Mulliken charges:
elementType: Cl O C C C C C C C C C C C C C C C H H H H H H H H H H H H H
charge: -0.061708 -0.221966 0.172832 0.326991 0.458779 -0.572062 -0.353676 0.007577 -0.423043 0.319088 -0.799583 -0.808269 -0.332474 -0.381651 -0.103964 -0.212092 -0.233337 0.238359 0.263311 0.238669 0.212711 0.261880 0.235143 0.229231 0.227760 0.240580 0.294933 0.277181 0.238289 0.260511
chargesum: 0.00000
title: Mulliken charges with hydrogens summed into heavy atoms:
elementType: Cl O C C C C C C C C C C C C C C C
charge: -0.061708 -0.221966 0.172832 0.326991 0.458779 -0.333702 -0.090365 0.007577 -0.184374 0.319088 -0.089848 -0.110698 -0.037541 -0.104470 -0.103964 0.026196 0.027174
polarizability: 2.42775099e+02 -1.23774877e+01 1.89026470e+02 1.47002331e+01 1.01092468e+00 1.06113162e+02
1716.lowfreq: -15.3945 -10.1669 -4.6738 -0.0013 0.0019 0.0021 4.1370 36.7890 42.8253
frequency: -14.3723 36.7513 42.8060 53.8267 100.0305 147.5981 156.2717 191.6912 193.8226 202.5765 231.7638 267.3816 294.7823 315.1476 351.4405 390.8169 416.3664 435.4057 445.1096 475.7159 518.6715 540.5737 569.7811 604.6251 652.1394 672.1230 711.9038 721.6862 744.6590 768.3157 809.4494 838.8213 892.8119 893.0201 912.6601 929.4191 948.0094 973.1038 984.4625 986.1762 992.4436 1024.9385 1043.1041 1047.7156 1072.4075 1090.6931 1119.6326 1165.1899 1175.8808 1181.4545 1246.5389 1263.3151 1292.8680 1294.3711 1368.1501 1378.0405 1395.7443 1397.9429 1405.4126 1407.1070 1455.5958 1457.3415 1466.2255 1472.3041 1472.6350 1489.9085 1534.7230 1566.2890 1577.0859 1601.4560 1617.2496 2976.7951 2991.1732 3058.5146 3078.5982 3088.8112 3088.9744 3116.8065 3127.5870 3144.6232 3152.5235 3165.3890 3170.3137 3176.8397
redmass: 1.0148 5.8001 4.4107 5.4993 5.6895 6.8340 1.0832 4.5478 4.1111 2.9986 5.0882 3.9957 3.3516 5.5821 7.9505 7.6580 3.5021 3.2061 2.9620 4.3926 4.4723 4.4899 4.5735 4.9019 6.7504 3.3174 3.3050 4.5117 5.1900 2.8861 1.5567 1.5588 3.1851 1.3007 1.4775 1.4571 4.2032 1.3609 5.5342 1.4803 1.3681 1.5093 1.5514 1.6140 2.2167 1.6657 2.4376 1.8155 1.1037 1.6951 2.5550 2.3920 1.5047 1.6321 6.9211 9.4510 1.5686 1.5973 1.3814 2.7009 1.1706 2.0500 1.1156 1.1945 1.0684 2.5381 7.5492 6.1671 7.0017 6.9093 6.1294 1.0389 1.0364 1.0945 1.0963 1.1002 1.1008 1.0912 1.0878 1.0874 1.0962 1.0926 1.0925 1.0989
irintensity: 0.5287 2.7267 0.7670 0.9757 1.6883 0.8847 1.3038 0.2832 1.9435 3.5369 0.9853 0.9142 0.6917 4.4277 3.6272 2.8892 3.1582 2.8709 5.9388 4.9844 1.5134 1.0434 2.5739 20.3443 9.4528 7.5563 22.2074 11.1163 63.4175 27.4686 22.9834 26.5089 29.4218 5.4406 7.5366 2.4632 33.0134 0.3154 3.2220 0.0434 2.9144 1.3203 0.9860 32.1686 26.1912 2.2065 15.7446 19.1756 5.1186 13.1077 35.8091 249.6930 0.9679 88.8035 12.7342 1.1841 18.0351 4.4588 14.0768 21.2479 21.7074 5.9354 0.4779 47.5700 15.3595 7.7454 180.9145 37.0837 16.3669 9.5354 80.3249 27.6079 21.3730 19.6182 10.1763 5.9691 34.0307 27.5354 12.2182 7.0542 11.5137 1.3578 0.6041 11.1245
temp: 298.150 k
press: 1.00000 atm
elementType: 17 8 6 6 6 6 6 6 6 6 6 6 6 6 6 6 6 1 1 1 1 1 1 1 1 1 1 1 1 1
symmnumber: 1
zpe: 609093.2 jmol-1
zpe.correction: 0.231991 hartree
zpe.thermalcorrener: 0.246968 hartree
zpe.thermalcorrenthalpy: 0.247913 hartree
zpe.thermalcorrgfe: 0.188774 hartree
zpe.sumelectzpe: -1113.497100 hartree
zpe.sumelectthermal: -1113.482123 hartree
zpe.sumelectthermalent: -1113.481179 hartree
zpe.sumelectthermalfe: -1113.540317 hartree
dipole: 1.1183 -1.4577 -0.8162
dipole: 2.0104
quadrupole: -87.9592 -112.0895 -106.0111
quadrupole: -10.5265 6.2120 2.1761
quadrupole: 14.0608 -10.0696 -3.9912 -10.5265 6.2120 2.1761
hfenergy: -1113.7290911 hartree
pointgroup: C01 [X(C15H13Cl1O1)]
dipole: -0.5705178 0.3247547 -0.4411583 debye
polarizability: 242.6896627|-10.1044927|171.7946345|-21.936058|-30.4801298|123.4304343 unknown
InChI: InChI=1S/C15H13ClO/c1-10-6-7-14(11(2)8-10)15(17)12-4-3-5-13(16)9-12/h3-9H,1-2H3
charge 0 multiplicity 1
30 atoms
Cl 3.157067 3.32904 -0.536189
O  0.498971 -2.282402 1.048386
C  -0.931205 -0.475238 0.312191
C  -1.988109 -0.653483 1.266329
C  -3.490921 0.713399 -0.172815
C  -3.234017 -0.03541 1.003907
C  -1.181017 0.283723 -0.86591
C  0.398367 -1.143323 0.490467
C  -2.439746 0.862114 -1.112372
C  1.656422 -0.46445 -0.00246
C  -1.818528 -1.456018 2.543412
C  -4.859698 1.316252 -0.428118
C  1.774565 0.949762 -0.071985
C  2.776848 -1.276814 -0.321563
C  3.002472 1.510027 -0.466104
C  3.99135 -0.689169 -0.727019
C  4.117775 0.71933 -0.803292
H  -4.037241 -0.147867 1.743346
H  -0.383891 0.397069 -1.608219
H  -2.608397 1.431163 -2.033959
H  -2.652979 -1.258465 3.238435
H  -1.785992 -2.537526 2.324352
H  -0.868178 -1.227131 3.056512
H  -5.352786 1.617537 0.512776
H  -4.797035 2.201615 -1.08439
H  -5.525139 0.584093 -0.926065
H  0.935575 1.595123 0.20169
H  2.67251 -2.362635 -0.233688
H  4.850084 -1.318525 -0.982798
H  5.058176 1.18661 -1.109859
