program: Gaussian 09
title: 000247593
version: EM64L-G09RevD.01
frameworkgroup: C1[X(C16H15ClO)]
method: RPBEPBE
basis: SDD
operation: Freq
keyword: #p
keyword: freq=noraman
keyword: PBEPBE/SDD
title: #p freq=noraman PBEPBE/SDD
converged: YES YES NO NO
title: Mulliken charges:
elementType: Cl O C C C C C C C C C C C C C C C C H H H H H H H H H H H H H H H
charge: -0.057141 -0.192993 0.066951 0.347577 0.347686 0.485943 -0.621228 -0.621455 -0.042272 -0.841747 -0.841722 0.324879 -0.815979 -0.301923 -0.373529 -0.112792 -0.208260 -0.232182 0.240279 0.240292 0.237856 0.254028 0.231808 0.237721 0.231781 0.254167 0.224963 0.237444 0.224961 0.290240 0.282861 0.240081 0.261705
chargesum: 0.00000
title: Mulliken charges with hydrogens summed into heavy atoms:
elementType: Cl O C C C C C C C C C C C C C C C C
charge: -0.057141 -0.192993 0.066951 0.347577 0.347686 0.485943 -0.380949 -0.381163 -0.042272 -0.118055 -0.118053 0.324879 -0.128611 -0.011683 -0.090667 -0.112792 0.031821 0.029523
polarizability: 2.28755843e+02 1.82646974e+01 1.80948033e+02 -3.54090757e-02 1.90823065e-02 1.41393257e+02
1716.lowfreq: -28.0559 -12.4275 -7.1951 0.0013 0.0020 0.0023 4.0151 4.8407 28.3709
frequency: -27.9102 3.2781 28.3303 37.2755 63.3556 63.6625 100.5866 105.1653 166.8677 175.7283 190.9409 200.2725 222.7344 246.9781 267.9730 299.0286 321.9648 362.0469 405.1590 419.3899 456.6480 488.6070 497.1708 513.3499 524.9968 552.5211 569.9990 609.0123 651.2940 674.5861 742.2121 745.9935 755.5022 814.1281 862.8653 894.8568 909.4146 910.1987 932.7002 942.4264 955.7899 983.9032 1002.6090 1016.5054 1017.5674 1042.0437 1043.1567 1044.8064 1050.3119 1067.9576 1089.4982 1124.3327 1170.8091 1185.6731 1251.0447 1253.7593 1287.7232 1317.3758 1357.1614 1383.1344 1397.7405 1398.1158 1400.0088 1407.4466 1413.8373 1442.4778 1455.8815 1467.5408 1467.9924 1473.4828 1473.6173 1481.1355 1492.6947 1550.5200 1577.3195 1579.6963 1602.6479 1618.3602 2976.1678 2976.2834 2977.0462 3054.4816 3054.6322 3057.6192 3086.0452 3088.0693 3088.4372 3115.4552 3119.5893 3144.8291 3160.4381 3163.8159 3175.9436
redmass: 4.2883 1.0348 5.5055 5.0515 1.0697 1.0605 3.7748 5.9543 4.9155 3.2366 4.7357 5.2795 2.8853 3.9717 2.5205 6.3975 3.6238 8.9802 7.2786 3.1329 3.1752 5.1458 3.9786 3.1713 5.2414 4.6434 4.3437 3.4640 6.7819 2.9219 2.9528 6.7294 4.3654 1.6005 1.3295 1.3153 1.4932 4.5740 1.6819 1.7309 3.7971 5.9457 1.3513 1.6831 1.5738 1.8139 1.5467 1.5207 1.6157 2.0580 1.6096 3.7692 1.1281 1.5610 2.3460 1.4244 1.5894 6.3168 7.2817 10.1110 1.2221 1.3426 1.2489 2.8601 2.3328 2.0629 2.2673 1.0674 1.0462 1.0553 1.0862 1.1615 1.4484 8.6208 7.4183 7.1086 7.2933 5.9278 1.0384 1.0379 1.0380 1.0967 1.0968 1.0951 1.0998 1.0990 1.0988 1.0909 1.0919 1.0873 1.0924 1.0929 1.0990
irintensity: 0.4744 0.7847 1.7671 0.2447 0.8603 0.5895 0.6965 1.2881 1.2657 3.8871 0.0702 1.4534 0.0007 5.0961 0.3102 2.8852 0.0789 2.8627 4.2100 0.9259 3.6000 0.8116 0.2009 0.0085 1.1046 6.8534 2.0452 12.9480 9.9991 11.3562 35.1094 56.6058 2.0091 29.5683 22.3992 0.0122 5.7254 59.5087 0.0681 2.7085 10.2854 3.1810 1.1290 9.7549 2.1040 0.1096 0.9513 0.0005 28.2874 25.4560 0.4301 29.0271 21.1079 41.5886 187.9742 0.0504 52.0127 12.2671 0.1061 2.8551 16.7062 23.0507 2.5136 18.1152 1.1336 33.0395 13.0081 34.4945 0.5010 13.1557 6.3618 31.0829 9.3590 159.5265 0.7639 15.0979 8.8928 45.5414 48.6694 34.4339 1.1518 1.0238 28.7036 21.8411 14.2558 19.9607 22.6205 25.3802 13.8569 6.0185 0.2520 1.6926 12.3058
temp: 298.150 k
press: 1.00000 atm
elementType: 17 8 6 6 6 6 6 6 6 6 6 6 6 6 6 6 6 6 1 1 1 1 1 1 1 1 1 1 1 1 1 1 1
symmnumber: 1
zpe: 677766.8 jmol-1
zpe.correction: 0.258148 hartree
zpe.thermalcorrener: 0.275498 hartree
zpe.thermalcorrenthalpy: 0.276442 hartree
zpe.thermalcorrgfe: 0.208830 hartree
zpe.sumelectzpe: -1152.722100 hartree
zpe.sumelectthermal: -1152.704750 hartree
zpe.sumelectthermalent: -1152.703805 hartree
zpe.sumelectthermalfe: -1152.771418 hartree
dipole: -0.3721 1.1364 -0.0010
dipole: 1.1958
quadrupole: -96.4450 -123.8114 -107.4092
quadrupole: 11.9186 -0.0172 0.0358
quadrupole: 12.7769 -14.5895 1.8127 11.9186 -0.0172 0.0358
hfenergy: -1152.9802474 hartree
pointgroup: C01 [X(C16H15Cl1O1)]
dipole: 0.103006 -0.4590263 0.0019296 debye
polarizability: 231.7935595|13.3846035|177.9092095|0.0019834|-0.1981541|141.3943636 unknown
InChI: InChI=1S/C16H15ClO/c1-10-7-11(2)15(12(3)8-10)16(18)13-5-4-6-14(17)9-13/h4-9H,1-3H3
charge 0 multiplicity 1
33 atoms
Cl 2.869237 -3.2666 0.012768
O  0.287188 2.669983 -0.009533
C  -1.009052 0.622659 -0.002078
C  -1.625156 0.2867 1.236807
C  -1.625406 0.281468 -1.2394
C  -3.491172 -0.768324 0.001106
C  -2.856885 -0.409873 1.215408
C  -2.857101 -0.415073 -1.214826
C  0.289804 1.402517 -0.003997
C  -0.982565 0.672834 2.559245
C  -0.982995 0.661897 -2.563576
C  1.589465 0.642385 -0.001078
C  -4.828738 -1.48767 0.002808
C  1.604282 -0.778057 0.004002
C  2.814655 1.36278 -0.00365
C  2.843141 -1.441183 0.006332
C  4.04159 0.671893 -0.001223
C  4.067801 -0.744774 0.003813
H  -3.331955 -0.673982 2.168668
H  -3.332306 -0.683293 -2.166865
H  0.024344 0.227269 2.672506
H  -0.860992 1.768927 2.63844
H  -1.596204 0.336026 3.411438
H  0.023987 0.216008 -2.674939
H  -1.596632 0.321228 -3.414233
H  -0.86162 1.757647 -2.647583
H  -4.945599 -2.124077 0.897526
H  -5.66747 -0.764443 0.002357
H  -4.946627 -2.126432 -0.890086
H  0.665273 -1.339993 0.005998
H  2.772193 2.456565 -0.007534
H  4.98719 1.223969 -0.003223
H  5.015623 -1.290983 0.005702
