program: Gaussian 09
title: 000247598
version: EM64L-G09RevD.01
frameworkgroup: C1[X(C17H15ClO3)]
method: RPBEPBE
basis: SDD
operation: Freq
keyword: #p
keyword: freq=noraman
keyword: PBEPBE/SDD
title: #p freq=noraman PBEPBE/SDD
converged: YES YES NO NO
title: Mulliken charges:
elementType: Cl O O O C C C C C C C C C C C C C C C C C H H H H H H H H H H H H H H H
charge: -0.026523 -0.183295 -0.288717 -0.238151 0.246718 0.353805 0.328653 0.002954 0.468917 -0.621426 -0.329908 0.091817 -0.396668 -0.809080 -0.277559 -0.810868 -0.349894 -0.238272 -0.213191 0.151842 -0.500363 0.237685 0.240112 0.232823 0.254500 0.261010 0.207766 0.281741 0.227975 0.233770 0.231410 0.263578 0.240077 0.245267 0.234645 0.246849
chargesum: 0.00000
title: Mulliken charges with hydrogens summed into heavy atoms:
elementType: Cl O O O C C C C C C C C C C C C C C C C C
charge: -0.026523 -0.183295 -0.288717 -0.238151 0.246718 0.353805 0.328653 0.002954 0.468917 -0.383741 -0.089796 0.091817 -0.163845 -0.085804 -0.277559 -0.117712 -0.068154 0.025306 0.026886 0.151842 0.226398
polarizability: 2.54988078e+02 -8.77896508e+00 2.00710176e+02 -9.40606409e+00 6.99145276e+00 1.71944560e+02
1716.lowfreq: -24.4551 -5.4771 -4.8867 0.0002 0.0007 0.0010 3.4179 14.8700 25.9054
frequency: -24.1103 14.8531 25.8566 47.7274 57.3841 79.3357 96.5890 109.3818 125.7990 136.8197 142.8043 185.2704 200.5747 203.1694 211.8690 233.1511 251.5667 279.7752 296.2626 319.4523 333.7580 369.1198 395.4746 411.2072 441.9619 449.9548 488.6383 497.2350 537.1353 547.3609 575.6376 612.4057 678.8684 686.6566 697.4249 708.9620 721.0152 756.7820 762.5913 791.4805 810.4551 837.5009 881.8324 891.1095 930.0044 934.7640 944.1698 968.6754 988.3463 990.9697 1023.7615 1044.5656 1048.2031 1053.9020 1076.8315 1114.6436 1120.1042 1146.5474 1149.3913 1167.2196 1183.0636 1193.6722 1246.0015 1250.5599 1262.7611 1291.5094 1365.9590 1375.3395 1392.8314 1397.0152 1405.6278 1415.4244 1421.9232 1437.6784 1451.4017 1451.7735 1463.7570 1466.5635 1469.2342 1476.3016 1492.6380 1548.9610 1558.2917 1581.1511 1593.2146 1617.8727 1621.9297 2977.1717 2986.5785 3006.1526 3055.2327 3074.6896 3086.5968 3087.9051 3108.5987 3118.1578 3122.5914 3148.5045 3150.5795 3151.0501 3171.7057 3187.8373
redmass: 1.0286 5.3437 3.8748 5.8766 5.2835 4.5807 1.3455 3.3796 4.8962 4.0740 10.7068 1.7844 4.0925 3.8886 1.6116 4.9338 7.5613 4.5650 2.9335 4.8224 7.3536 5.7585 9.2960 5.6759 2.9702 3.2756 5.4235 6.0567 5.0304 3.5092 3.9221 5.8185 5.8106 4.5730 7.4631 6.5705 5.3305 3.3443 2.4285 5.3068 2.0748 1.5510 4.9492 1.2780 1.3860 8.7157 3.9857 1.3717 1.4723 1.3499 1.5292 1.5903 1.6287 3.5866 4.3178 1.2630 2.3099 1.6540 1.5824 1.7699 1.6306 1.4332 3.0855 2.9230 3.2485 1.5478 10.6132 5.5618 1.9066 1.2969 1.4342 2.5878 1.2749 2.4766 1.0650 1.0496 1.0520 1.1469 1.0639 1.1758 2.7342 7.4198 7.1708 7.6181 7.6039 8.7364 6.7223 1.0376 1.0363 1.0295 1.0969 1.0960 1.1012 1.0989 1.1046 1.0910 1.0875 1.0959 1.0890 1.1036 1.0944 1.0970
irintensity: 0.3934 1.5196 0.4409 0.3055 1.5158 0.9129 0.3462 0.4312 1.2028 2.9960 1.4263 2.6627 1.8090 1.4782 0.4714 2.7478 5.8108 8.3619 1.5547 19.5354 6.9103 1.5147 6.4169 3.4418 5.8412 1.1932 5.7773 13.7838 0.0865 1.9984 4.9319 7.6911 13.9010 23.2814 12.5061 27.0711 4.9926 17.5618 42.2732 21.1840 18.8145 30.4603 52.1225 2.6041 0.2121 30.5490 21.3537 0.2030 4.2147 0.9330 3.2068 3.2270 27.1517 25.4410 31.2953 0.0320 24.4366 39.0952 126.3197 1.7530 3.3535 62.6601 138.1297 176.2848 181.6431 2.5002 3.9460 26.2401 4.4220 12.9523 17.1745 34.2118 14.3554 11.6991 11.0422 15.4963 12.8857 5.9993 17.7224 36.1653 14.3919 174.5720 30.3806 64.8382 46.3279 184.8071 49.2212 30.8525 20.1282 35.1778 18.1279 7.0642 24.4735 22.2567 22.3560 27.7149 14.9225 12.5852 2.4310 20.3744 4.2123 5.9575
temp: 298.150 k
press: 1.00000 atm
elementType: 17 8 8 8 6 6 6 6 6 6 6 6 6 6 6 6 6 6 6 6 6 1 1 1 1 1 1 1 1 1 1 1 1 1 1 1
symmnumber: 1
zpe: 714590.0 jmol-1
zpe.correction: 0.272173 hartree
zpe.thermalcorrener: 0.292063 hartree
zpe.thermalcorrenthalpy: 0.293007 hartree
zpe.thermalcorrgfe: 0.221763 hartree
zpe.sumelectzpe: -1341.053039 hartree
zpe.sumelectthermal: -1341.033149 hartree
zpe.sumelectthermalent: -1341.032205 hartree
zpe.sumelectthermalfe: -1341.103449 hartree
dipole: 0.8460 2.2292 -4.2728
dipole: 4.8930
quadrupole: -105.4736 -117.8899 -130.9308
quadrupole: 0.4598 -3.5011 3.7062
quadrupole: 12.6245 0.2082 -12.8327 0.4598 -3.5011 3.7062
hfenergy: -1341.3252124 hartree
pointgroup: C01 [X(C17H15Cl1O3)]
dipole: -0.5150981 -0.4706211 -1.7941761 debye
polarizability: 247.8585104|-21.2262785|209.7687296|4.537176|-2.5433855|170.0155744 unknown
InChI: InChI=1S/C17H15ClO3/c1-10-7-8-12(11(2)9-10)16(19)15-13(17(20)21-3)5-4-6-14(15)18/h4-9H,1-3H3
charge 0 multiplicity 1
36 atoms
Cl 0.095098 3.598604 1.226905
O  -0.012261 0.341802 2.514044
O  -3.082457 -1.730593 -0.695447
O  -1.052798 -1.786602 0.437613
C  1.33403 0.126453 0.491044
C  2.328563 -0.759251 1.024607
C  -1.056718 1.14235 0.518193
C  0.117077 0.490545 1.264076
C  3.658372 -0.482606 -1.061693
C  3.463925 -1.040746 0.22584
C  1.516678 0.675215 -0.809206
C  -2.101508 0.367078 -0.072535
C  2.658998 0.386369 -1.573093
C  2.192451 -1.426314 2.377426
C  -1.207602 2.545327 0.500362
C  4.891931 -0.811861 -1.8819
C  -3.233813 0.998609 -0.648584
C  -2.322295 3.189213 -0.070166
C  -3.344136 2.402543 -0.646924
C  -1.992392 -1.123224 -0.065611
C  -3.056051 -3.212316 -0.714956
H  4.22353 -1.724813 0.624785
H  0.754743 1.347752 -1.217897
H  2.782231 0.832868 -2.567054
H  2.23816 -0.68906 3.197652
H  1.208111 -1.918283 2.475507
H  2.989432 -2.176444 2.522409
H  -4.015092 0.373756 -1.087374
H  5.61641 -1.41141 -1.305217
H  4.624968 -1.38694 -2.789235
H  5.403728 0.107696 -2.221552
H  -2.387313 4.281107 -0.05976
H  -4.218808 2.889706 -1.089109
H  -2.160617 -3.570564 -1.249845
H  -3.976537 -3.50146 -1.2407
H  -3.043742 -3.606108 0.315092
