program: Gaussian 09
title: 000247617
version: EM64L-G09RevD.01
frameworkgroup: C1[X(C17H24N8O4)]
method: RPBEPBE
basis: SDD
operation: Freq
keyword: #p
keyword: freq=noraman
keyword: PBEPBE/SDD
title: #p freq=noraman PBEPBE/SDD
converged: YES YES NO NO
title: Mulliken charges:
elementType: O O O O N N N N N N N N C C C C C C C C C C C C C C C C C H H H H H H H H H H H H H H H H H H H H H H H H
charge: -0.276780 -0.276716 -0.296283 -0.296235 -0.207234 -0.207072 -0.192229 -0.192265 -0.070100 -0.070074 -0.684478 -0.684479 -0.614501 0.205462 0.205281 0.166346 0.166456 0.073863 0.073691 0.206370 0.206354 0.149501 0.149483 -0.613802 -0.613797 -0.786177 -0.785975 -0.600257 -0.600269 0.250331 0.250315 0.278302 0.253358 0.233324 0.233330 0.278309 0.253358 0.282867 0.252414 0.254076 0.252481 0.254033 0.282779 0.269718 0.251817 0.250821 0.250774 0.269741 0.251867 0.315774 0.340212 0.340180 0.315734
chargesum: 0.00000
title: Mulliken charges with hydrogens summed into heavy atoms:
elementType: O O O O N N N N N N N N C C C C C C C C C C C C C C C C C
charge: -0.276780 -0.276716 -0.296283 -0.296235 -0.207234 -0.207072 -0.192229 -0.192265 -0.070100 -0.070074 -0.028492 -0.028566 -0.113854 0.205462 0.205281 0.166346 0.166456 0.073863 0.073691 0.206370 0.206354 0.149501 0.149483 0.151181 0.151201 0.003180 0.003318 0.172099 0.172114
polarizability: 4.19112788e+02 6.07695173e-02 2.96125634e+02 -1.35569136e+01 1.44835517e-02 1.53681920e+02
1716.lowfreq: -3.8816 -1.9856 -0.0011 -0.0009 -0.0008 4.0705 13.3327 16.5890 29.9547
frequency: 12.3446 16.5879 29.9458 52.7197 54.6315 62.4057 89.8437 89.9694 98.1271 98.4987 100.3334 101.7247 111.1587 116.3409 116.6880 129.1615 132.8971 166.3642 173.8347 180.5849 187.3214 220.2079 224.2515 226.7621 296.4007 303.3265 304.3108 311.4464 313.9583 320.2898 321.5228 342.0597 354.6782 368.0295 371.3901 378.9864 381.6354 384.2393 396.6468 397.3752 441.3335 441.3775 455.9183 459.6097 472.2427 508.2735 519.5640 541.1836 554.2820 562.4087 582.8165 609.9247 639.9119 671.0588 681.4056 699.0208 699.6429 712.4017 727.6778 729.7328 743.1497 744.9568 753.2338 801.0998 816.5633 897.4112 908.7766 933.7772 936.3471 951.4718 1001.1041 1006.0566 1026.0596 1040.6715 1049.1257 1059.7774 1085.1059 1088.7204 1091.0837 1096.2228 1123.5872 1125.5510 1129.2466 1130.2346 1130.4942 1192.6989 1208.9232 1224.6899 1243.1267 1243.4912 1268.3555 1268.7081 1275.9310 1277.5331 1298.6238 1299.5171 1326.8523 1327.6932 1390.9189 1392.9999 1403.5903 1403.8919 1429.4795 1429.9498 1439.4510 1440.2973 1441.1086 1446.8543 1449.7561 1471.9680 1472.0541 1473.2021 1474.6129 1476.4485 1476.7203 1480.9169 1481.3174 1489.6764 1489.8444 1541.7222 1550.9659 1581.2557 1596.7838 1602.2927 1607.1250 1612.1071 1624.6278 1626.9265 1631.1900 2915.4200 2915.7517 3005.4081 3005.4764 3013.8710 3013.9111 3023.1657 3031.2719 3031.4803 3096.9712 3097.0495 3101.6731 3106.1282 3106.1451 3110.5641 3112.1671 3137.2913 3137.3807 3141.8442 3141.8835 3430.2081 3430.8063 3573.9846 3574.7246
redmass: 5.7068 6.4969 5.2744 5.2320 4.4517 3.4836 3.3054 3.7678 2.8303 1.1995 1.2416 2.8711 3.1073 1.2062 1.2120 3.7846 3.5212 3.0138 1.2333 1.2419 4.0367 3.2419 3.3854 4.8107 3.3527 4.1854 4.1970 3.3717 3.0405 1.2180 3.1527 4.6932 3.9766 4.7396 4.7546 4.4053 5.0779 3.5788 8.5818 8.1655 3.3977 3.2840 7.6953 4.0218 1.7671 4.3680 3.8610 4.0190 6.2018 4.6145 4.9607 6.2319 3.9414 2.5039 5.6411 9.8687 11.0584 2.2528 9.2007 4.6574 3.0210 5.0299 1.5074 3.8360 3.8539 2.8339 3.5267 2.9670 2.8972 1.9017 1.5915 1.6206 2.1715 2.0160 2.3530 2.1126 2.3608 2.7452 2.6121 2.1928 1.3870 1.2934 1.4417 1.3126 1.3447 2.9650 2.4363 3.7009 3.5694 3.5591 2.3651 1.4232 3.1136 3.0033 5.7217 5.4948 5.4039 5.3298 1.2345 1.2176 1.6148 1.5831 1.2726 1.2637 1.6880 1.3831 1.2534 1.0868 1.1231 1.0470 1.0460 1.0699 1.0769 1.0691 1.0653 1.1383 1.1379 1.1728 1.1682 4.7449 6.8507 9.7258 7.1234 2.9962 4.9289 2.0030 2.9262 6.5533 2.0787 1.0527 1.0527 1.0348 1.0348 1.0328 1.0328 1.0576 1.0799 1.0797 1.1005 1.1005 1.1052 1.1021 1.1021 1.0992 1.0999 1.1014 1.1014 1.1026 1.1026 1.0461 1.0463 1.0986 1.0992
irintensity: 0.9333 0.7834 0.3637 0.0174 0.5514 1.0643 0.9192 1.3329 0.8507 0.4572 0.7301 0.2964 0.2518 0.9137 0.8374 21.1602 3.9229 10.2456 1.6469 0.3388 3.7956 0.0119 1.6792 1.0661 9.8633 11.9585 2.1616 5.9921 5.1926 110.6142 0.6567 13.4240 5.5367 13.9494 1.1740 5.9726 38.1133 55.2211 20.6392 18.3513 3.2531 3.0192 5.6497 8.7521 4.5534 13.9813 8.6959 1.8131 1.4007 33.8188 0.1649 16.4293 3.0853 127.9015 13.2472 9.5877 0.0147 294.3155 0.0632 34.7969 13.3776 1.0116 11.0923 0.1205 5.4290 4.0897 0.5782 0.8624 0.1381 17.7744 1.3523 12.8993 9.1548 3.5906 0.5067 3.5225 19.8940 205.6064 0.9204 5.6619 2.2822 0.9855 7.2204 0.1916 2.5209 125.1573 4.8149 96.4189 14.8780 0.4574 1.6365 22.4713 1.3462 0.9426 87.2580 5.6524 9.8058 138.9032 67.0752 23.7369 0.1941 2.0899 60.8190 164.9373 297.7895 35.5578 45.0987 64.8474 16.1080 19.0405 8.5433 7.4431 3.2495 70.6570 0.2764 0.2426 64.7240 176.0963 12.0567 57.0417 802.6760 577.9198 3.4671 145.8413 143.7416 142.8587 73.0639 427.1458 0.7520 50.0724 19.4788 14.1509 47.0111 49.3318 9.8772 15.0677 12.0395 2.7505 14.9903 19.1929 4.3857 8.2506 23.8164 0.3628 17.8031 0.7278 0.7747 0.8493 0.8514 86.4947 2.6241 86.2775 35.5339
temp: 298.150 k
press: 1.00000 atm
elementType: 8 8 8 8 7 7 7 7 7 7 7 7 6 6 6 6 6 6 6 6 6 6 6 6 6 6 6 6 6 1 1 1 1 1 1 1 1 1 1 1 1 1 1 1 1 1 1 1 1 1 1 1 1
symmnumber: 1
zpe: 1093742.1 jmol-1
zpe.correction: 0.416584 hartree
zpe.thermalcorrener: 0.447303 hartree
zpe.thermalcorrenthalpy: 0.448247 hartree
zpe.thermalcorrgfe: 0.353530 hartree
zpe.sumelectzpe: -1399.002212 hartree
zpe.sumelectthermal: -1398.971493 hartree
zpe.sumelectthermalent: -1398.970549 hartree
zpe.sumelectthermalfe: -1399.065266 hartree
dipole: -0.0054 -4.4210 0.0094
dipole: 4.4210
quadrupole: -222.3467 -175.9527 -167.1741
quadrupole: -0.0068 3.4134 -0.0177
quadrupole: -33.8555 12.5385 21.3170 -0.0068 3.4134 -0.0177
hfenergy: -1399.418796 hartree
pointgroup: C01 [X(C17H24N8O4)]
dipole: -0.0046332 1.7393222 0.011509 debye
polarizability: 419.3005612|0.488184|296.1248021|11.547504|0.6732585|153.4949792 unknown
InChI: InChI=1S/C17H24N8O4/c1-8(20-12-10(18)14(26)24(5)16(28)22(12)3)7-9(2)21-13-11(19)15(27)25(6)17(29)23(13)4/h7,18-19H2,1-6H3
charge 0 multiplicity 1
53 atoms
O  -6.828658 0.751131 -0.098627
O  6.829937 0.803671 0.09206
O  -3.996433 -2.98286 0.224989
O  4.026098 -2.949793 -0.253407
N  -4.502691 1.082345 -0.171728
N  4.501701 1.115923 0.175515
N  -5.421598 -1.107492 0.101048
N  5.4369 -1.064372 -0.117843
N  -2.161841 1.493452 -0.335184
N  2.157841 1.507089 0.348494
N  -1.73956 -1.458698 -0.006775
N  1.757771 -1.444971 -0.002113
C  -0.00628 2.559182 0.01178
C  -3.190743 0.560554 -0.099412
C  3.193807 0.58435 0.102984
C  -1.144666 1.656852 0.485081
C  1.13854 1.669275 -0.469375
C  -2.996876 -0.816815 -0.001794
C  3.010372 -0.79362 -0.005258
C  -5.654912 0.277305 -0.062092
C  5.659875 0.320821 0.055801
C  -4.144207 -1.719637 0.111636
C  4.16426 -1.686479 -0.129429
C  -4.70123 2.53984 -0.337146
C  4.689183 2.573555 0.351964
C  -0.996783 0.974053 1.828041
C  0.994297 0.995255 -1.817196
C  -6.623461 -1.9636 0.221455
C  6.645041 -1.909922 -0.24953
H  -0.374725 3.189553 -0.814545
H  0.357455 3.185277 0.843465
H  -5.782979 2.71058 -0.43573
H  -4.168804 2.892347 -1.234622
H  -4.321315 3.08826 0.54215
H  4.301317 3.12599 -0.521326
H  5.769915 2.752229 0.447641
H  4.157631 2.914502 1.254428
H  -0.894548 -0.125012 1.685131
H  -0.129425 1.357996 2.386581
H  -1.914431 1.107945 2.431253
H  0.124775 1.378284 -2.372996
H  1.911164 1.138262 -2.419472
H  0.897855 -0.105299 -1.681704
H  -6.276223 -2.999128 0.347748
H  -7.24567 -1.870998 -0.683577
H  -7.225054 -1.644674 1.088041
H  7.23941 -1.58139 -1.117541
H  6.305521 -2.94749 -0.380024
H  7.271296 -1.817209 0.652663
H  -1.017305 -1.097117 -0.635092
H  -1.840653 -2.481387 0.014098
H  1.866556 -2.466654 -0.032068
H  1.035656 -1.094563 0.632654
