program: Gaussian 09
title: 000247535
version: EM64L-G09RevD.01
frameworkgroup: C1[X(C7H14O8S)]
method: RPBEPBE
basis: SDD
operation: Freq
keyword: #p
keyword: freq=noraman
keyword: PBEPBE/SDD
title: #p freq=noraman PBEPBE/SDD
converged: NO YES NO NO
title: Mulliken charges:
elementType: S O O O O O O O O C C C C C C C H H H H H H H H H H H H H H
charge: 1.066414 -0.290213 -0.439052 -0.455414 -0.423260 -0.374940 -0.430766 -0.493178 -0.520685 -0.113173 -0.164077 -0.135839 -0.110244 -0.051472 -0.343501 -0.741277 0.272044 0.295624 0.210752 0.240249 0.236837 0.205270 0.222123 0.348791 0.368875 0.354291 0.358897 0.338086 0.283591 0.285248
chargesum: 0.00000
title: Mulliken charges with hydrogens summed into heavy atoms:
elementType: S O O O O O O O O C C C C C C C
charge: 1.066414 -0.290213 -0.439052 -0.106623 -0.054385 -0.020649 -0.071870 -0.493178 -0.520685 0.158871 0.131547 0.074913 0.130005 0.185364 0.083891 0.165648
polarizability: 1.67953148e+02 -7.18524957e+00 1.29323703e+02 1.66347866e+00 1.61398089e+00 1.05387538e+02
1716.lowfreq: -5.5079 -0.0018 -0.0015 0.0014 4.6230 9.7155 43.6905 57.8274 63.5500
frequency: 43.5377 57.7930 63.5472 73.6725 102.3043 111.7846 132.1882 159.4506 170.5448 176.9959 196.2756 206.2623 238.6886 247.6538 258.1325 273.3287 298.6288 323.8041 340.5387 355.3668 364.0147 413.0959 422.3098 427.8215 447.7598 450.7958 471.7307 512.0280 562.8644 574.1451 593.8060 678.6597 732.9877 820.4345 833.6360 844.1764 912.1008 919.4548 926.4399 949.0405 965.0356 988.3353 1002.3307 1021.2413 1027.3457 1053.3945 1058.4154 1079.7527 1090.5202 1121.2855 1186.4395 1189.5171 1208.5252 1232.0405 1259.3140 1269.7284 1280.0872 1307.2450 1309.1170 1320.7341 1329.8657 1330.1240 1348.7832 1374.1707 1382.4147 1386.1868 1396.4316 1410.1508 1432.9517 1464.3094 2926.0884 2968.6290 2986.8630 3001.8759 3013.1361 3038.8881 3069.0260 3084.3849 3162.3649 3184.3910 3520.2036 3535.0273 3540.2639 3557.6400
redmass: 5.7526 6.4434 5.9854 6.8102 3.8992 6.5968 6.3467 5.5092 3.2272 3.5623 2.1418 1.6386 3.3318 3.4757 3.9927 4.0183 2.5978 4.2887 7.0884 5.9366 4.0043 2.1446 1.7928 2.1954 1.4238 5.5283 1.3095 4.8926 4.5128 5.6624 6.3165 5.1704 3.9877 3.9387 12.1889 3.4569 6.4990 6.3600 3.0786 2.3351 3.0643 2.3111 1.7610 4.3238 3.1624 2.5779 2.3399 2.4538 2.3711 2.5653 1.3282 1.3451 1.3169 1.2014 1.2298 1.2232 1.4905 1.4514 1.2551 1.2299 1.1919 1.2202 1.3166 1.3625 1.2981 1.1929 1.3293 1.0488 1.0532 1.0871 1.0817 1.0819 1.0674 1.0840 1.0253 1.0871 1.0872 1.0978 1.1083 1.1077 1.0652 1.0654 1.0656 1.0658
irintensity: 2.0919 2.4240 4.7083 0.7763 6.6537 8.7570 2.2725 0.5614 3.1894 8.4979 6.1234 4.7656 20.3150 30.9556 2.3547 5.5646 40.6028 5.0741 45.6978 47.5713 13.4066 22.1753 114.3657 88.5933 144.4810 14.6738 191.8706 5.2479 14.0057 13.3552 54.1962 60.7330 14.5205 29.4029 67.6564 52.2434 103.0092 145.9578 62.2141 45.7524 48.5545 1.1192 90.6538 85.3944 27.0113 36.7911 89.5266 152.0110 89.9102 21.3927 24.4240 23.7856 44.1259 21.6626 9.9964 3.4510 20.7387 19.1331 39.3889 0.8613 10.2517 0.1291 7.8562 32.6050 43.6203 13.4629 41.9690 6.7566 12.7131 4.7517 39.5829 8.2735 46.2027 21.9906 13.7435 27.7396 3.2721 21.5598 13.1046 0.1691 9.1051 12.4563 19.5598 23.9930
temp: 298.150 k
press: 1.00000 atm
elementType: 16 8 8 8 8 8 8 8 8 6 6 6 6 6 6 6 1 1 1 1 1 1 1 1 1 1 1 1 1 1
symmnumber: 1
zpe: 586782.5 jmol-1
zpe.correction: 0.223494 hartree
zpe.thermalcorrener: 0.242002 hartree
zpe.thermalcorrenthalpy: 0.242946 hartree
zpe.thermalcorrgfe: 0.177398 hartree
zpe.sumelectzpe: -1273.474893 hartree
zpe.sumelectthermal: -1273.456385 hartree
zpe.sumelectthermalent: -1273.455440 hartree
zpe.sumelectthermalfe: -1273.520989 hartree
dipole: 1.2011 -1.0457 4.5644
dipole: 4.8343
quadrupole: -123.5386 -113.0638 -97.9210
quadrupole: -9.2652 5.2209 0.4565
quadrupole: -12.0309 -1.5560 13.5868 -9.2652 5.2209 0.4565
hfenergy: -1273.6983867 hartree
pointgroup: C01 [X(C7H14O8S1)]
dipole: -0.6202083 -0.0361768 -1.7976181 debye
polarizability: 168.8885341|3.7657282|128.2692821|-1.8175995|2.2871091|105.506573 unknown
InChI: InChI=1S/C7H14O8S/c1-16(12,13)15-6-4(9)3(2-8)14-7(11)5(6)10/h3-11H,2H2,1H3
charge 0 multiplicity 1
30 atoms
S  -3.176763 0.125981 0.545927
O  2.309105 0.121453 -0.343228
O  -1.641811 1.16737 0.127532
O  -0.239564 -0.793948 -1.469848
O  0.351925 2.97666 1.005295
O  3.015227 2.357856 -0.073663
O  3.528915 -2.395618 -0.002367
O  -4.3194 1.159289 1.016323
O  -2.718958 -1.105466 1.500012
C  -0.349282 0.634541 0.595152
C  0.038375 -0.737068 -0.02734
C  0.609685 1.793158 0.199753
C  1.529038 -0.992134 0.268708
C  2.091252 1.394677 0.402509
C  2.110852 -2.276567 -0.333667
C  -3.505549 -0.482866 -1.227584
H  -0.356577 0.532768 1.69986
H  -0.588946 -1.529585 0.413156
H  0.453439 2.005776 -0.884122
H  1.706522 -0.993631 1.365896
H  2.328752 1.246765 1.472557
H  1.942889 -2.287233 -1.42973
H  1.62136 -3.160159 0.108666
H  0.461625 -0.265811 -1.935191
H  -0.62114 3.168705 0.959025
H  2.725957 2.719309 -0.950026
H  3.966216 -1.54739 -0.277444
H  -2.537722 -0.87117 -1.580348
H  -4.297464 -1.241135 -1.148682
H  -3.823362 0.410774 -1.781431
