program: Gaussian 09
title: 000247524
version: EM64L-G09RevD.01
frameworkgroup: C1[X(C12H11NO3)]
method: RPBEPBE
basis: SDD
operation: Freq
keyword: #p
keyword: freq=noraman
keyword: PBEPBE/SDD
title: #p freq=noraman PBEPBE/SDD
converged: YES YES NO YES
title: Mulliken charges:
elementType: O O O N C C C C C C C C C C C C H H H H H H H H H H H
charge: -0.280668 -0.426962 -0.256347 -0.009795 0.461649 -0.072504 -0.403040 0.239443 -0.521001 -0.275393 -0.475431 0.292270 -0.372755 0.180114 -0.223353 -0.672964 0.285978 0.265483 0.264549 0.277125 0.225932 0.230986 0.230990 0.213283 0.231379 0.231378 0.359654
chargesum: 0.00000
title: Mulliken charges with hydrogens summed into heavy atoms:
elementType: O O O N C C C C C C C C C C C C
charge: -0.280668 -0.067308 -0.256347 -0.009795 0.461649 -0.072504 -0.117062 0.239443 -0.255519 -0.010844 -0.198305 0.292270 -0.146823 0.180114 0.238624 0.003075
polarizability: 2.71239401e+02 -5.09008231e-01 1.43417539e+02 -8.81970936e-03 -1.92836976e-03 6.67553704e+01
1716.lowfreq: -20.9448 -3.6192 -0.0007 0.0008 0.0011 4.4169 13.7484 53.8401 76.1827
frequency: -9.0442 53.5970 76.1642 80.6572 122.4335 134.8783 183.8555 236.5903 272.2805 272.7585 297.5663 303.0510 334.8761 356.8910 413.2020 423.3362 454.3158 477.0873 505.3534 551.5733 599.6879 619.5795 637.7579 721.3221 727.5549 751.2904 781.2429 785.2501 796.4171 829.3948 835.8537 872.0859 942.9301 944.1099 957.7732 959.3596 969.3496 1023.6495 1082.1188 1112.4551 1122.9633 1135.6092 1141.4442 1178.5828 1206.7502 1219.2136 1248.6592 1254.7583 1275.4660 1342.9823 1355.3656 1367.1634 1395.9451 1399.1677 1432.9342 1463.3355 1464.1410 1472.6884 1486.0208 1495.2287 1555.0902 1597.0643 1613.9159 1642.1463 2996.5965 3010.0459 3068.9618 3093.5558 3108.8596 3117.4052 3147.7741 3159.3318 3160.4417 3172.0480 3586.2041
redmass: 2.8528 3.3833 5.9692 4.2966 3.9256 3.4947 5.6834 1.4622 3.0822 5.5643 4.9268 6.1192 1.1052 4.0527 5.5339 4.2615 6.2705 2.8816 5.0153 5.0466 7.2574 8.6363 2.9269 7.3104 5.3937 5.4092 2.1169 6.3170 1.1031 2.1344 4.0617 1.5465 1.4666 3.5266 4.8520 1.3948 1.4664 2.3862 3.5256 2.2432 1.6053 1.4688 1.3552 1.5047 2.6843 2.4026 1.1332 2.6376 1.8609 1.7501 1.5482 3.5193 3.1604 1.2692 4.5057 1.0403 4.1349 1.0684 1.0723 3.9750 7.4585 6.4240 10.9255 6.6192 1.0358 1.0580 1.1067 1.0985 1.1026 1.0900 1.0927 1.0925 1.0922 1.0953 1.0662
irintensity: 0.3374 3.3408 0.1688 1.5345 0.4640 0.0183 0.3134 1.9683 11.0773 8.6055 3.3807 13.7723 143.5417 9.3010 3.6935 3.9049 0.9642 8.7945 3.6010 5.1075 7.2953 8.1625 6.2883 25.1549 12.5498 2.1379 2.7770 13.1519 3.5781 49.8885 17.9229 9.9058 15.2170 22.9898 19.3103 0.0000 24.4311 70.4355 209.8460 6.0395 127.2732 5.9433 180.1816 254.8454 76.8438 244.7288 0.0149 55.2970 10.6052 21.7781 6.4710 0.6933 6.7020 22.4828 11.5026 12.4570 23.2517 4.1815 13.7740 101.9164 38.4409 84.7884 173.2264 53.6284 22.1133 20.4766 8.2754 31.4713 42.8545 15.1006 0.5192 5.5765 1.3941 6.8219 66.8639
temp: 298.150 k
press: 1.00000 atm
elementType: 8 8 8 7 6 6 6 6 6 6 6 6 6 6 6 6 1 1 1 1 1 1 1 1 1 1 1
symmnumber: 1
zpe: 538244.8 jmol-1
zpe.correction: 0.205007 hartree
zpe.thermalcorrener: 0.218395 hartree
zpe.thermalcorrenthalpy: 0.219339 hartree
zpe.thermalcorrgfe: 0.164775 hartree
zpe.sumelectzpe: -743.168225 hartree
zpe.sumelectthermal: -743.154837 hartree
zpe.sumelectthermalent: -743.153893 hartree
zpe.sumelectthermalfe: -743.208457 hartree
dipole: 1.1616 1.1196 0.0002
dipole: 1.6133
quadrupole: -54.6825 -101.6021 -94.9352
quadrupole: 2.7858 -0.0026 0.0001
quadrupole: 29.0575 -17.8622 -11.1953 2.7858 -0.0026 0.0001
hfenergy: -743.373232 hartree
pointgroup: C01 [X(C12H11N1O3)]
dipole: 0.4627667 -0.4344361 -0.0000673 debye
polarizability: 271.203876|2.1906039|143.4530641|0.0088443|-0.0018122|66.7553704 unknown
InChI: InChI=1S/C12H11NO3/c1-2-16-12(15)9-5-8-6-10(14)3-4-11(8)13-7-9/h3-7,14H,2H2,1H3
charge 0 multiplicity 1
27 atoms
O  -3.432588 -0.197352 -0.000377
O  4.950284 1.352284 -0.000074
O  -2.640664 1.996786 -0.000292
N  0.333387 -1.882389 -0.000026
C  1.369578 0.389674 -0.000087
C  1.456105 -1.060297 -0.000038
C  0.061685 0.968055 -0.000124
C  -1.063544 0.134608 -0.00011
C  2.56323 1.17285 -0.000097
C  2.747043 -1.673761 -0.000001
C  -0.874751 -1.293306 -0.000064
C  3.807977 0.537636 -0.000061
C  3.903878 -0.893661 -0.000012
C  -2.416867 0.759745 -0.000136
C  -4.831136 0.332216 -0.000625
C  -5.758183 -0.878721 -0.000905
H  -0.075895 2.055086 -0.000155
H  2.516678 2.266297 -0.000134
H  2.792453 -2.766593 0.000036
H  -1.748943 -1.951118 -0.000053
H  4.891483 -1.373549 0.000017
H  -4.960072 0.967877 0.89402
H  -4.959708 0.96801 -0.895228
H  -6.810864 -0.54191 -0.001097
H  -5.592754 -1.501851 -0.896157
H  -5.593123 -1.501985 0.894321
H  5.777509 0.809866 -0.000043
