program: Gaussian 09
title: 000020235
version: EM64L-G09RevD.01
frameworkgroup: C1[X(C11H13FO3)]
method: RPBEPBE
basis: SDD
operation: Freq
keyword: #p
keyword: freq=noraman
keyword: PBEPBE/SDD
title: #p freq=noraman PBEPBE/SDD
converged: YES YES NO NO
title: Mulliken charges:
elementType: F O O O C C C C C C C C C C C H H H H H H H H H H H H H
charge: -0.235800 -0.258014 -0.266837 -0.243266 0.441164 -0.654165 -0.338488 -0.399024 0.319771 -0.347595 -0.349468 0.291055 -0.245817 -0.212699 -0.538429 0.240949 0.236182 0.252799 0.233331 0.250365 0.240610 0.225803 0.255937 0.198237 0.215892 0.220191 0.222076 0.245241
chargesum: 0.00000
title: Mulliken charges with hydrogens summed into heavy atoms:
elementType: F O O O C C C C C C C C C C C
charge: -0.235800 -0.258014 -0.266837 -0.243266 0.441164 -0.177034 -0.085689 -0.165693 0.319771 -0.097230 -0.108858 0.291055 0.235923 0.201430 0.149078
polarizability: 1.68562199e+02 1.73960093e+01 1.21859026e+02 -1.28558144e+01 1.29908588e+01 9.75353405e+01
1716.lowfreq: -7.4927 -0.0005 -0.0004 -0.0001 3.6611 7.1960 16.4754 17.4722 34.3386
frequency: 12.0338 16.3556 34.3101 58.5823 75.2838 104.1110 147.1138 160.6575 194.8710 214.7775 233.8175 289.3665 312.9346 343.9877 394.0715 411.9215 415.0813 451.3091 500.6402 520.4545 588.7201 631.8418 682.5473 712.1413 760.3728 785.6922 808.5662 821.0741 836.9115 848.5168 918.5054 935.1431 945.4773 965.5611 988.3159 1003.9526 1006.4940 1040.7859 1090.4473 1103.6193 1111.8209 1120.1623 1156.3759 1180.1734 1191.6415 1204.3134 1228.5724 1230.8445 1240.8060 1286.6206 1310.0535 1358.4731 1385.4328 1388.1757 1419.5404 1436.0023 1445.4719 1449.7216 1455.3026 1466.5838 1472.6475 1501.9149 1586.3664 1622.8848 1640.3653 2958.7992 3007.9676 3020.2640 3021.6799 3046.2464 3078.2058 3094.4067 3098.5235 3124.5466 3129.7482 3138.1095 3163.6734 3169.1341
redmass: 5.9356 4.1995 4.8279 5.6988 5.0909 4.3799 4.1343 3.8690 4.4454 3.3977 1.2464 3.0466 3.1643 4.9691 2.3684 4.5836 3.1253 2.8274 3.5395 3.0145 4.8886 6.6755 5.0255 3.6858 4.3320 3.1333 1.8419 1.8281 3.0232 2.2802 4.0742 1.7457 1.6745 1.3636 8.4094 2.7303 2.7315 2.3314 1.9493 2.2868 1.2605 1.3899 1.3349 1.2473 1.0937 2.4305 1.6480 3.7537 1.1058 1.4583 1.3529 1.3593 1.6274 3.1957 3.2751 1.1708 1.0789 1.0933 1.0983 1.0504 1.0726 2.4383 7.0417 6.6226 9.7195 1.0330 1.0575 1.0592 1.0608 1.1039 1.1053 1.1082 1.1017 1.0990 1.0896 1.0893 1.0941 1.0961
irintensity: 0.8411 1.8789 4.9673 2.4465 1.5207 9.4500 5.3149 0.9242 5.3134 4.7524 0.4510 6.9936 2.0989 2.4477 5.3224 2.6073 0.3348 19.0807 9.3240 20.4949 14.0434 0.4027 6.6800 5.1834 11.8766 11.5237 26.9788 5.8255 21.4416 46.1771 59.2986 1.9248 17.3790 0.9601 41.2656 9.0848 26.0244 23.9034 159.6141 6.5364 0.2754 96.7393 2.2784 60.4364 4.3128 3.9849 140.8726 171.1255 9.7230 39.9504 12.7182 4.3620 0.7080 10.4517 4.5300 11.0957 9.7277 10.6314 21.4598 13.9603 51.2390 120.9610 10.7947 40.7563 175.4815 66.3824 4.6453 53.1868 17.6080 49.5833 14.3685 29.8766 5.4594 29.6707 7.7347 7.3479 14.5208 3.4066
temp: 298.150 k
press: 1.00000 atm
elementType: 9 8 8 8 6 6 6 6 6 6 6 6 6 6 6 1 1 1 1 1 1 1 1 1 1 1 1 1
symmnumber: 1
zpe: 576049.4 jmol-1
zpe.correction: 0.219406 hartree
zpe.thermalcorrener: 0.234594 hartree
zpe.thermalcorrenthalpy: 0.235538 hartree
zpe.thermalcorrgfe: 0.172988 hartree
zpe.sumelectzpe: -751.337098 hartree
zpe.sumelectthermal: -751.321909 hartree
zpe.sumelectthermalent: -751.320965 hartree
zpe.sumelectthermalfe: -751.383515 hartree
dipole: -0.6906 0.8696 1.5936
dipole: 1.9424
quadrupole: -65.9837 -91.8397 -86.7256
quadrupole: 11.4060 1.9929 -1.5575
quadrupole: 15.5326 -10.3234 -5.2092 11.4060 1.9929 -1.5575
hfenergy: -751.5565032 hartree
pointgroup: C01 [X(C11H13F1O3)]
dipole: -0.2959858 0.5535028 0.4358871 debye
polarizability: 168.2534447|12.2195349|128.2653389|-17.7227205|-0.4361147|91.4377823 unknown
InChI: InChI=1S/C11H13FO3/c1-14-10-4-2-9(3-5-10)8-11(13)15-7-6-12/h2-5H,6-8H2,1H3
charge 0 multiplicity 1
28 atoms
F  -3.923927 2.071028 -1.322516
O  -2.688015 -0.113078 0.301378
O  4.284899 0.244395 -0.864291
O  -1.958352 -2.296039 -0.063024
C  0.538141 -0.543044 0.964704
C  -0.810293 -0.87146 1.608146
C  1.320957 -1.567112 0.366032
C  1.025988 0.782533 0.937438
C  3.038121 0.061374 -0.245334
C  2.558355 -1.273455 -0.232046
C  2.269323 1.096618 0.340364
C  -1.849865 -1.20863 0.547361
C  -3.6801 -0.298334 -0.790137
C  -4.606698 0.89899 -0.77928
C  4.819855 1.606649 -0.91567
H  -0.715288 -1.755173 2.264205
H  -1.16929 -0.019845 2.207447
H  0.949017 -2.598036 0.360824
H  0.429905 1.587716 1.382973
H  3.169324 -2.054677 -0.694291
H  2.617712 2.133657 0.338099
H  -4.243082 -1.23453 -0.612829
H  -3.146023 -0.388822 -1.752432
H  -5.48257 0.710307 -1.427467
H  -4.926377 1.152794 0.246715
H  4.982325 2.01501 0.101048
H  4.150096 2.281556 -1.483612
H  5.784162 1.517007 -1.437004
