program: Gaussian 09
title: 000247489
version: EM64L-G09RevD.01
frameworkgroup: C1[X(C11H12N2O)]
method: RPBEPBE
basis: SDD
operation: Freq
keyword: #p
keyword: freq=noraman
keyword: PBEPBE/SDD
title: #p freq=noraman PBEPBE/SDD
converged: NO YES NO NO
title: Mulliken charges:
elementType: O N N C C C C C C C C C C C H H H H H H H H H H H H
charge: -0.241218 -0.410735 0.014694 0.411610 -0.022025 0.396923 0.367070 -0.615944 -0.562366 0.059458 -0.813276 0.043302 -0.813298 -0.762827 0.237692 0.265745 0.329850 0.231403 0.232938 0.231521 0.239400 0.226456 0.226403 0.243123 0.243117 0.240981
chargesum: 0.00000
title: Mulliken charges with hydrogens summed into heavy atoms:
elementType: O N N C C C C C C C C C C C
charge: -0.241218 -0.080885 0.014694 0.411610 -0.022025 0.396923 0.367070 -0.378252 -0.296621 0.059458 -0.117414 0.043302 -0.121038 -0.035605
polarizability: 2.43686551e+02 -2.32848159e+00 1.33357179e+02 -1.44475524e-02 5.11840233e-04 6.73173067e+01
1716.lowfreq: -2.9039 -0.0007 -0.0006 -0.0002 9.8050 12.8095 78.3100 87.7132 114.6602
frequency: 78.2536 87.7109 114.6584 122.6337 166.1476 178.5508 206.3473 234.1415 287.5538 292.8688 314.8172 363.8560 379.1035 389.8837 426.8035 477.1994 492.2377 512.4630 587.3714 623.8713 636.2634 699.9761 704.8675 737.1663 753.4224 778.6348 794.3896 863.9132 869.8998 909.3664 982.5279 1003.5415 1018.7045 1032.2620 1034.1538 1053.8397 1117.1173 1166.9997 1187.6107 1229.1598 1253.9140 1289.0215 1301.1897 1355.7225 1391.0881 1391.6739 1397.2254 1411.3546 1436.9159 1443.5324 1450.3585 1461.6780 1477.5167 1479.7387 1485.3327 1491.8060 1543.6154 1567.6374 1618.6487 1637.4175 2971.2525 2973.4300 2990.1302 3042.3769 3046.8880 3064.8902 3086.6348 3089.5787 3116.9377 3128.2646 3152.8552 3501.3348
redmass: 4.2393 3.5643 1.0909 1.0705 2.6463 1.2237 3.5105 3.0430 3.4834 2.6634 3.6505 4.8285 4.2856 5.8902 4.1702 3.1854 4.0458 4.7214 8.1845 4.1610 4.0106 2.0575 5.6098 5.1234 1.9039 3.3996 6.1457 2.7647 1.4715 1.4309 1.8202 1.4468 1.5452 1.4511 1.5616 1.6324 3.6080 5.0606 1.7873 3.9845 1.3644 4.9302 2.8294 3.6655 1.4101 2.7457 1.2421 1.3232 1.5217 1.0462 1.2890 1.0463 1.0447 1.2943 1.6327 2.8267 6.8739 6.2890 5.1823 7.1398 1.0382 1.0380 1.0375 1.0970 1.0967 1.0954 1.0987 1.0978 1.0915 1.1003 1.0922 1.0768
irintensity: 1.5605 0.4403 0.5954 0.0427 7.2232 0.0630 0.3463 0.9395 5.7149 2.3148 2.2443 4.8237 2.1618 1.0576 2.9912 5.1232 8.8038 7.6102 11.5402 1.5780 0.0086 15.9080 0.9201 0.4698 52.5848 22.3242 0.0068 2.1351 40.2481 11.0903 28.7634 12.8696 0.3720 21.6701 1.4010 0.0499 1.0767 37.9009 4.3699 14.9708 4.5966 2.7150 7.2077 15.9672 40.9469 3.2159 9.4370 17.1001 7.1350 15.0569 17.3431 0.6661 32.4446 2.3650 19.1511 29.0935 20.7392 17.3889 509.8979 10.8871 51.9675 23.9925 7.8380 33.4740 5.9851 11.4077 32.9818 4.3685 16.6816 9.7960 4.7800 26.0058
temp: 298.150 k
press: 1.00000 atm
elementType: 8 7 7 6 6 6 6 6 6 6 6 6 6 6 1 1 1 1 1 1 1 1 1 1 1 1
symmnumber: 1
zpe: 544063.1 jmol-1
zpe.correction: 0.207223 hartree
zpe.thermalcorrener: 0.220118 hartree
zpe.thermalcorrenthalpy: 0.221062 hartree
zpe.thermalcorrgfe: 0.168554 hartree
zpe.sumelectzpe: -610.127026 hartree
zpe.sumelectthermal: -610.114131 hartree
zpe.sumelectthermalent: -610.113186 hartree
zpe.sumelectthermalfe: -610.165695 hartree
dipole: -4.9186 -0.7268 0.0003
dipole: 4.9720
quadrupole: -84.6030 -78.4905 -84.2894
quadrupole: 7.2146 -0.0034 0.0003
quadrupole: -2.1420 3.9705 -1.8284 7.2146 -0.0034 0.0003
hfenergy: -610.3342484 hartree
pointgroup: C01 [X(C11H12N2O1)]
dipole: 1.933233 0.2984484 0.0001112 debye
dipolederiv: -1.3442748 0.2595492 -0.0003275 0.6943149 -0.6482024 0.0002018 0.0006324 -0.0002472 -0.3775128 -0.9593047 0.3348611 0.0000647 -0.2499404 -0.2277609 0.0000084 -0.0000763 0.0000444 -0.2954711 0.1095459 -0.044189 0.0001743 0.2097867 -0.2177343 -0.0000493 -0.0000416 -0.0000223 -0.2296429 0.4577829 -0.3678895 0.0001054 -0.0489803 0.1327145 -0.0000156 -0.0001111 -0.0001065 0.1343419 -0.1905877 0.0269949 -0.0001168 -0.2403084 -0.0631534 -0.0000304 0.000107 0.0000091 0.0361879 0.2649118 0.0983344 0.0001587 0.4378207 0.172707 0.0001265 0.0007111 0.0002629 -0.0188454 0.041085 -0.2341093 0.0000274 -0.5727778 -0.0959693 -0.0000918 -0.0001413 0.0000392 -0.0723104 -0.2858262 0.1070253 -0.0000359 0.0037743 0.0541231 0.000018 -0.0001117 0.0000367 -0.2227604 0.2000996 0.1009605 0.0000447 -0.0841401 0.0913998 0.0000096 0.0000584 -0.0000131 -0.1445421 0.4191054 0.2165912 -0.0001596 0.8419984 0.1363571 -0.0000187 -0.0003955 -0.0000915 0.0409811 -0.1964052 -0.1052716 -0.0000764 -0.0218124 0.0597486 -0.0001187 -0.0009386 -0.000427 0.0543669 1.5885801 -0.3868881 0.0002163 -0.8192037 0.4944571 -0.0001314 -0.0002826 0.0003215 0.2479949 -0.1152394 0.0930764 -0.0000308 0.0335517 0.0449657 -0.0000173 0.000085 -0.0001365 0.0752313 -0.4158402 -0.1462668 0.0001053 -0.0616564 0.0118043 0.0000432 0.0003925 0.0001642 0.0211164 0.0581697 0.0139098 0.0000156 -0.0199485 -0.1176142 0.0000198 0.0000337 0.0000595 0.1636749 0.0971835 -0.0040865 -0.0000141 0.0229824 -0.055823 0.000009 -0.0000074 0.0000293 0.1469993 0.1283658 -0.0300605 -0.0000382 -0.0125889 0.1527889 0.0000011 -0.0000318 -0.0000526 0.3143363 -0.0366839 -0.0137572 0.0828905 -0.002248 0.0726589 -0.0772593 0.1342851 -0.0304865 -0.0368103 0.0771391 0.0877646 -0.0001901 -0.0450744 -0.1465333 0.000498 0.0001632 0.0005219 0.1104044 -0.0363686 -0.0143013 -0.0828193 -0.0030749 0.0729498 0.0767947 -0.1340603 0.0301151 -0.0377143 0.0780443 -0.0980894 0.0000576 0.0328426 -0.1318294 0.0001685 -0.0000243 0.0001589 0.1110789 -0.0531482 0.0247885 0.0894141 -0.0038961 0.0726141 0.0737548 0.1423349 0.0227559 -0.0459377 -0.0531401 0.02464 -0.089416 -0.0040448 0.0725276 -0.0739072 -0.1423495 -0.022852 -0.0457629 0.0359457 -0.0057635 -0.0748476 -0.0212226 0.0793315 0.0662335 -0.1037902 0.0245969 -0.021826 0.0360448 -0.0058442 0.0747701 -0.0213471 0.0793798 -0.0661481 0.1036624 -0.0245761 -0.0220734 0.0948154 0.0680212 0.0000274 -0.044807 -0.0959076 -0.0000992 -0.0001036 -0.0001042 0.1144953 unknown
polarizability: 243.7120464|-1.6150202|133.3316839|0.0144506|-0.0004184|67.3173067 unknown
InChI: InChI=1S/C11H12N2O/c1-6-4-9-10(5-7(6)2)13-11(14)8(3)12-9/h4-5,13H,1-3H3
charge 0 multiplicity 1
26 atoms
O  -3.580748 1.450411 0.00046
N  -1.244003 1.421198 0.000122
N  -1.278111 -1.388481 0.000431
C  -0.017453 0.747439 0.000355
C  -0.061222 -0.682602 0.000422
C  2.43728 0.696287 0.000658
C  2.408154 -0.742804 0.000715
C  1.228021 1.42049 0.000476
C  1.163958 -1.398441 0.00061
C  -2.422809 -0.712257 0.00026
C  3.761511 1.435771 0.001044
C  -2.500233 0.784415 -0.000263
C  3.698772 -1.541547 0.000935
C  -3.734524 -1.448183 0.000641
H  1.25394 2.517556 0.000389
H  1.103176 -2.491605 0.000676
H  -1.26512 2.446623 0.000184
H  4.371275 1.173016 -0.884672
H  3.614848 2.528822 -0.001317
H  4.368593 1.176575 0.889693
H  3.493669 -2.624889 0.001688
H  4.319677 -1.315829 -0.887541
H  4.32011 -1.314638 0.888797
H  -4.339475 -1.16567 -0.880835
H  -4.338596 -1.166357 0.88296
H  -3.553087 -2.533302 0.000211
