program: Gaussian 09
title: 000247479
version: EM64L-G09RevD.01
frameworkgroup: C1[X(C10H14O)]
method: RPBEPBE
basis: SDD
operation: Freq
keyword: #pfreq=noraman
keyword: PBEPBE/SDD
title: #p freq=noraman PBEPBE/SDD
converged: NO YES NO NO
title: Mulliken charges:
elementType: O C C C C C C C C C C H H H H H H H H H H H H H H
charge: -0.434409 0.371989 -0.590058 0.304588 -0.545768 0.457167 -0.402649 -0.330227 -0.436615 -0.835833 -0.813534 0.202457 0.233425 0.237343 0.226689 0.230989 0.194384 0.229453 0.223126 0.231158 0.232471 0.229802 0.228964 0.222855 0.332233
chargesum: 0.00000
title: Mulliken charges with hydrogens summed into heavy atoms:
elementType: O C C C C C C C C C C
charge: -0.102176 0.371989 -0.154176 0.304588 -0.308425 0.457167 -0.175960 0.095145 -0.207163 -0.149078 -0.131913
polarizability: 1.40989396e+02 -7.14217147e+00 1.20512109e+02 -9.09692535e+00 -4.40511973e+00 6.86906127e+01
1716.lowfreq: -5.8809 0.0006 0.0007 0.0008 10.9953 15.0907 39.7777 60.3201 93.3782
frequency: 39.6538 60.1388 93.3628 108.6722 133.1704 155.1666 250.3696 267.5133 296.3970 308.1613 332.4232 349.8373 436.0687 457.1048 466.2857 562.1704 618.9976 714.6356 729.7997 756.6680 807.6064 821.2558 898.3100 923.4821 951.9761 962.8833 987.0985 1004.3700 1020.3661 1035.4139 1044.0358 1048.9411 1109.6551 1143.1974 1166.4062 1218.8733 1255.0717 1264.4819 1288.4916 1295.4630 1336.8623 1370.6652 1381.1180 1396.1211 1398.7372 1410.7125 1463.9464 1470.4953 1470.8810 1476.0479 1482.1263 1487.2024 1501.2795 1586.9313 1625.4261 2959.3238 2968.6206 2974.1811 2985.4652 3042.4909 3046.3055 3051.9564 3079.4672 3081.3943 3085.6944 3102.5272 3112.4333 3137.8309 3560.0606
redmass: 1.0339 4.2385 3.5517 2.1459 1.9550 1.2194 3.5085 2.4009 2.8743 1.3610 2.9541 2.8553 2.9343 2.8744 3.5113 3.5963 5.0429 4.0537 3.2354 4.0948 1.1936 1.2653 1.4011 2.6208 1.6337 2.4253 1.8207 1.3886 2.7022 1.8369 1.7223 1.5529 1.5252 1.4803 1.4824 1.8805 2.0818 1.7230 1.2559 1.3517 1.3282 5.0143 1.2024 1.2692 1.2504 3.0520 1.0942 1.0522 1.0554 1.0916 1.0931 1.1053 2.9267 5.8059 6.5644 1.0689 1.0380 1.0371 1.0618 1.0969 1.0973 1.0977 1.0979 1.0986 1.0977 1.0911 1.0871 1.0968 1.0662
irintensity: 0.5833 2.2564 0.4829 6.2772 0.9121 0.2013 3.0661 8.9604 5.5291 89.3962 17.1027 48.0166 3.6029 11.3810 0.7323 0.8064 1.9742 0.4562 1.6006 1.0743 4.4062 33.0022 5.4252 2.1724 28.2261 84.8956 3.1906 5.8600 27.5526 32.6852 5.2632 16.4562 7.1638 15.0239 6.9541 0.6583 4.0566 19.0865 1.4564 0.8720 8.8170 0.2464 24.1479 16.7426 2.0985 2.4347 4.4170 1.9025 17.0138 12.7132 20.2536 11.9947 28.6040 3.2152 6.4378 49.4962 39.5556 37.6987 44.1362 20.2644 18.4106 22.4269 23.3944 21.1708 24.5237 23.4788 14.3631 28.7263 8.5898
temp: 298.150 k
press: 1.00000 atm
elementType: 8 6 6 6 6 6 6 6 6 6 6 1 1 1 1 1 1 1 1 1 1 1 1 1 1
symmnumber: 1
zpe: 558837.2 jmol-1
zpe.correction: 0.212850 hartree
zpe.thermalcorrener: 0.224831 hartree
zpe.thermalcorrenthalpy: 0.225775 hartree
zpe.thermalcorrgfe: 0.174282 hartree
zpe.sumelectzpe: -463.846780 hartree
zpe.sumelectthermal: -463.834799 hartree
zpe.sumelectthermalent: -463.833855 hartree
zpe.sumelectthermalfe: -463.885348 hartree
dipole: 0.7280 1.6363 0.5172
dipole: 1.8641
quadrupole: -65.9395 -65.0169 -69.7623
quadrupole: -9.7485 -4.5220 -1.6658
quadrupole: 0.9668 1.8893 -2.8561 -9.7485 -4.5220 -1.6658
hfenergy: -464.05963 hartree
pointgroup: C01 [X(C10H14O1)]
dipole: -0.3081249 0.6288184 -0.2180268 debye
dipolederiv: -1.0672084 0.2074248 -0.088235 0.1914673 -0.2138137 -0.14576 -0.1035868 -0.1469394 -0.5106568 0.2874946 -0.096759 -0.0296858 -0.170826 -0.0344134 0.0287902 -0.1242806 0.0397845 -0.0825745 -0.21731 0.0842612 -0.0585182 0.1378339 0.0945637 0.0054681 -0.237572 0.0537381 0.0105462 -0.0028873 0.1853722 -0.0077714 0.2104852 0.1181623 -0.0219177 0.0124829 -0.0437518 -0.0570752 -0.2010502 -0.1014823 -0.0352638 -0.0661862 0.0092661 0.0438641 -0.0098995 0.0483343 -0.1738396 0.1301314 0.1886337 0.0005094 0.2297404 0.2123391 -0.0082003 0.0108514 -0.0034852 -0.0219219 -0.0250938 -0.1038256 -0.0379936 -0.0305659 0.0566007 0.0347261 -0.026279 0.0520357 -0.1430306 0.8439579 -0.1528187 -0.0030231 -0.139003 0.2941506 0.054778 0.1726296 0.0191309 0.3454373 -0.0017334 -0.0361415 -0.0566499 -0.1423226 -0.1334839 0.0359489 -0.0593024 0.0163828 -0.163458 -0.0301015 -0.1295032 0.0038946 -0.0679898 -0.0151259 0.0124069 0.0207674 0.0386344 0.0765919 0.0251875 -0.0672226 -0.0027683 -0.1335313 -0.0817274 0.0074003 -0.0151713 -0.0145547 0.0702396 -0.0488756 -0.0613141 0.063187 -0.1144411 -0.0355158 0.1107704 0.0471533 0.0672676 0.0095082 0.0480029 -0.0100517 -0.0042506 0.0402023 -0.061452 -0.1211238 0.0105735 -0.0756552 -0.0118218 0.0735904 0.0608354 0.0291147 0.0514433 -0.0992622 -0.042162 0.0244254 -0.044045 0.1202177 0.0648222 0.0333407 0.0188352 0.0589815 -0.1293283 -0.0467052 0.0257655 -0.0459161 0.1367815 0.0032931 -0.0509184 0.0507081 -0.0524731 -0.0376124 0.094742 0.0434935 0.0477368 0.0247701 -0.0184515 0.0328402 0.0123043 0.0406583 -0.1048078 -0.1640452 0.0180077 -0.1097489 -0.0591129 -0.1301422 0.0295549 0.0620039 0.0188235 0.0803805 -0.0135954 0.0631589 -0.0166324 0.138676 -0.1014175 -0.0377453 -0.1051487 0.001231 0.0653277 0.0511322 -0.1315366 0.0005365 0.0067403 0.0248833 -0.0672472 0.0846897 -0.0483092 0.0486007 -0.0095244 0.1060608 0.0572174 -0.0969027 0.0362494 0.1500336 0.0383816 0.0375441 -0.0984628 -0.0426411 0.0222573 -0.0718476 0.08986 0.0513061 -0.0500187 0.0143769 -0.067176 0.0122679 -0.0838606 -0.050371 -0.1239299 -0.0827218 0.0396192 0.0291357 -0.0625583 -0.0235074 -0.0579479 0.1085014 -0.006124 0.1359493 0.0050068 -0.1274471 0.0078927 0.0539286 0.1171995 0.0510051 -0.0355855 0.072443 -0.0093388 0.0890272 0.3431804 -0.0442769 0.0599328 -0.0792786 0.0602889 0.1465927 0.114053 0.1290968 0.279713 unknown
polarizability: 140.5475749|7.6481291|121.193922|-9.0390102|3.0370926|68.4506215 unknown
InChI: InChI=1S/C10H14O/c1-8-3-4-9(2)10(7-8)5-6-11/h3-4,7,11H,5-6H2,1-2H3
charge 0 multiplicity 1
25 atoms
O  3.944155 -1.110762 0.347476
C  0.321527 -0.008158 -0.364955
C  1.769913 -0.370049 -0.666173
C  -0.073959 1.338083 -0.093816
C  -0.645843 -1.040165 -0.304957
C  -2.003241 -0.792316 0.020155
C  -1.430392 1.587588 0.226589
C  2.564003 -0.690598 0.626497
C  -2.382571 0.545234 0.286087
C  0.915279 2.491386 -0.159386
C  -3.011714 -1.927252 0.07406
H  2.279594 0.4554 -1.201916
H  1.819851 -1.26037 -1.319985
H  -0.329366 -2.070159 -0.520657
H  -1.747168 2.617401 0.433423
H  2.111839 -1.551473 1.145773
H  2.543626 0.179107 1.318148
H  -3.425193 0.773931 0.538462
H  1.779536 2.33663 0.514204
H  1.32075 2.625975 -1.181116
H  0.431596 3.439334 0.132576
H  -3.107278 -2.429088 -0.90759
H  -2.710043 -2.700825 0.805347
H  -4.012706 -1.563235 0.363568
H  4.422401 -0.370218 -0.104514
