program: Gaussian 09
title: 000247483
version: EM64L-G09RevD.01
frameworkgroup: C1[X(C10H20O)]
method: RPBEPBE
basis: SDD
operation: Freq
keyword: #pfreq=noraman
keyword: PBEPBE/SDD
title: #p freq=noraman PBEPBE/SDD
converged: YES YES NO NO
title: Mulliken charges:
elementType: O C C C C C C C C C C H H H H H H H H H H H H H H H H H H H H
charge: -0.219567 -0.091997 -0.061268 -0.451034 -0.362573 0.190015 -0.733803 -0.722093 -0.354948 -0.805963 -0.698637 0.194893 0.203798 0.193065 0.237651 0.203053 0.180558 0.220458 0.207262 0.218938 0.200497 0.248909 0.228800 0.192648 0.202365 0.249877 0.239321 0.252897 0.207821 0.216676 0.212381
chargesum: 0.00000
title: Mulliken charges with hydrogens summed into heavy atoms:
elementType: O C C C C C C C C C C
charge: -0.219567 0.102896 0.142530 -0.020319 0.021038 0.190015 -0.087145 -0.043887 0.040065 -0.063868 -0.061759
polarizability: 1.22832266e+02 1.19522788e+00 1.07451992e+02 2.01011731e+00 -2.82771204e+00 1.00087293e+02
1716.lowfreq: -12.8277 -5.1668 -0.0009 -0.0006 0.0002 7.1454 50.1616 53.6787 64.9366
frequency: 50.0854 53.2955 64.7687 70.8475 111.6402 131.1050 147.8118 166.5412 217.5231 225.7709 229.2333 257.4818 264.5008 276.9102 318.0844 379.1998 407.1628 440.0814 483.9991 594.8363 616.8812 721.7927 743.8394 793.7069 831.7704 893.1065 918.3868 927.1382 937.4969 957.1427 958.6053 1000.1205 1019.6020 1049.4599 1070.0309 1095.9871 1101.8404 1125.8229 1142.1289 1176.1454 1182.4982 1212.9206 1240.1176 1266.1486 1276.8377 1291.9571 1292.3500 1321.7450 1334.0331 1351.7668 1360.6834 1369.5668 1384.4444 1390.5673 1401.0662 1442.6777 1451.3605 1456.0335 1464.6797 1470.4651 1470.8562 1476.0780 1478.0537 1485.6499 1486.3119 1490.1223 1623.2460 2950.2055 2951.4644 2966.0149 2967.0378 2969.0456 2971.2612 2972.0344 2976.2926 2984.7414 2995.1633 3022.8398 3048.7039 3060.2135 3062.0462 3067.8518 3067.9934 3071.1829 3074.6096 3091.0398 3116.3657
redmass: 3.0404 4.2247 1.5683 3.0047 2.8812 2.2966 1.1307 2.8533 1.8274 1.3412 1.1883 1.8956 1.2886 2.6197 2.8426 2.4258 2.6619 2.8419 3.0742 2.5134 2.8789 1.3240 1.5262 1.9598 1.7025 1.8838 1.1900 1.7854 1.3869 1.6833 1.5716 2.4212 2.3932 1.6982 2.4719 2.0589 1.8735 1.7382 2.4830 2.3847 2.2178 1.4777 1.2243 1.4075 1.2298 1.2047 1.0935 1.4420 1.3885 1.6114 1.2272 1.5441 1.2112 1.2166 1.2114 1.0756 1.0536 1.0737 1.0754 1.0553 1.0458 1.0671 1.0429 1.0532 1.0737 1.0499 6.9667 1.0671 1.0746 1.0636 1.0538 1.0584 1.0417 1.0583 1.0393 1.0373 1.0958 1.1017 1.1013 1.0957 1.0988 1.0993 1.1003 1.0993 1.0984 1.0995 1.1008
irintensity: 1.9937 4.3287 0.1888 0.0544 1.3105 0.2317 0.8388 0.1827 0.9931 0.7894 0.1453 2.2498 1.2452 0.5501 0.8443 0.2821 0.6280 0.2054 4.0892 0.5420 7.1233 9.0523 2.2489 0.3612 0.0502 5.7883 2.1427 5.9519 2.5081 6.3790 1.6040 2.8218 0.8620 0.7486 0.6203 5.9873 5.9003 2.6097 0.9156 60.9373 31.0413 4.8573 7.9932 20.2630 2.2849 3.1800 0.4785 2.2701 1.4339 1.9940 46.4956 29.0272 30.8399 11.0230 19.7514 16.6391 15.2033 5.3845 1.2550 2.0872 4.4465 3.2558 12.1042 11.6347 11.7981 18.4070 78.2416 5.8230 22.2756 6.3578 19.7516 52.6796 69.3751 44.0162 13.6507 22.7827 8.7936 16.5126 25.4065 14.5319 40.3950 51.3904 58.2974 54.7621 62.0510 32.1387 15.4892
temp: 298.150 k
press: 1.00000 atm
elementType: 8 6 6 6 6 6 6 6 6 6 6 1 1 1 1 1 1 1 1 1 1 1 1 1 1 1 1 1 1 1 1
symmnumber: 1
zpe: 728706.6 jmol-1
zpe.correction: 0.277550 hartree
zpe.thermalcorrener: 0.292219 hartree
zpe.thermalcorrenthalpy: 0.293164 hartree
zpe.thermalcorrgfe: 0.235862 hartree
zpe.sumelectzpe: -467.367079 hartree
zpe.sumelectthermal: -467.352409 hartree
zpe.sumelectthermalent: -467.351465 hartree
zpe.sumelectthermalfe: -467.408767 hartree
dipole: -0.0823 -0.2897 -2.8992
dipole: 2.9148
quadrupole: -69.5325 -68.7205 -75.8280
quadrupole: -0.1242 2.8139 -3.0564
quadrupole: 1.8278 2.6398 -4.4676 -0.1242 2.8139 -3.0564
hfenergy: -467.6446289 hartree
pointgroup: C01 [X(C10H20O1)]
dipole: -0.0228784 0.1993743 1.1290619 debye
polarizability: 122.856295|-0.7103504|106.8904804|-2.1245806|-3.425362|100.6247758 unknown
InChI: InChI=1S/C10H20O/c1-5-6-7-10(8(2)3)9(4)11/h8,10H,5-7H2,1-4H3
charge 0 multiplicity 1
31 atoms
O  -0.771812 -1.270149 -1.54046
C  -0.577984 0.095929 0.480495
C  -1.854496 1.020191 0.42261
C  0.69029 0.818648 -0.048234
C  2.005276 0.090234 0.312538
C  -0.804451 -1.224437 -0.278952
C  -3.096625 0.336818 1.045431
C  -2.177304 1.542707 -0.996869
C  3.26285 0.833231 -0.193354
C  -1.055559 -2.478926 0.548975
C  4.575718 0.099366 0.155361
H  -0.422528 -0.15427 1.551354
H  -1.598829 1.895593 1.057926
H  0.714211 1.847698 0.366377
H  0.615764 0.90903 -1.148337
H  1.994443 -0.930888 -0.122124
H  2.074108 -0.034501 1.414261
H  -3.456041 -0.497268 0.413258
H  -2.882848 -0.061263 2.056055
H  -3.927812 1.059919 1.137864
H  -3.0739 2.18992 -0.964861
H  -2.374595 0.709625 -1.693926
H  -1.346483 2.137564 -1.414788
H  3.281303 1.855011 0.238378
H  3.189249 0.960557 -1.292352
H  -1.871196 -2.313883 1.276914
H  -0.148439 -2.719419 1.138161
H  -1.300185 -3.331671 -0.103991
H  4.68708 -0.017586 1.250209
H  5.459241 0.649773 -0.217073
H  4.594057 -0.911753 -0.293445
