program: Gaussian 09
title: 000247480
version: EM64L-G09RevD.01
frameworkgroup: C1[X(C10H17NO)]
method: RPBEPBE
basis: SDD
operation: Freq
keyword: #p
keyword: freq=noraman
keyword: PBEPBE/SDD
title: #p freq=noraman PBEPBE/SDD
converged: YES YES NO NO
title: Mulliken charges:
elementType: O N C C C C C C C C C C H H H H H H H H H H H H H H H H H
charge: -0.419865 -0.209749 0.237889 0.205817 0.119658 0.126686 -0.404939 -0.807334 -0.798812 -0.806954 -0.807684 -0.308959 0.222683 0.213417 0.235477 0.212614 0.238428 0.221128 0.223534 0.238077 0.210449 0.223206 0.221612 0.223657 0.209105 0.223121 0.189515 0.235190 0.333033
chargesum: 0.00000
title: Mulliken charges with hydrogens summed into heavy atoms:
elementType: O N C C C C C C C C C C
charge: -0.086831 -0.209749 0.237889 0.205817 0.119658 0.126686 0.031161 -0.120815 -0.116073 -0.151687 -0.151801 0.115745
polarizability: 1.40586036e+02 1.35659409e+00 1.31440704e+02 -1.06592117e+01 6.40477221e-01 8.16800948e+01
1716.lowfreq: -15.8041 -4.3771 -0.0006 0.0005 0.0007 10.7846 53.5250 69.7077 85.6478
frequency: 53.5009 69.5762 85.5961 92.7730 115.3710 130.2814 147.8091 161.4369 169.0542 221.9379 251.9932 277.2738 291.0271 295.5806 313.3294 325.8732 362.8580 475.3413 541.9568 557.6788 568.6455 588.4137 634.2028 660.7303 788.2709 802.1460 854.0207 947.3604 954.2348 976.1332 1026.1344 1030.2666 1033.6365 1043.2584 1047.3027 1051.2862 1082.8733 1089.9855 1154.0186 1199.0413 1213.3990 1268.3093 1327.1680 1362.0499 1373.8341 1383.2181 1390.0562 1395.8883 1403.2525 1414.1955 1415.1069 1440.2912 1454.6005 1458.2159 1463.1891 1468.2512 1469.5510 1471.3323 1473.8209 1476.0489 1484.6265 1485.9596 1569.3346 1616.5252 2944.6224 2946.9607 2952.6836 2958.3485 2959.3116 2992.4458 3007.6312 3024.4618 3025.1510 3026.1453 3043.6907 3067.1304 3069.9552 3086.0711 3087.0729 3092.5062 3554.5722
redmass: 4.3581 3.2514 1.0717 1.0299 2.1911 1.4674 1.3749 1.6997 1.5749 3.6706 2.5390 2.0245 2.6359 2.5774 1.9568 2.8148 1.8786 2.5936 3.3670 2.8902 3.6200 3.8001 4.5356 4.0683 2.5162 2.5056 2.8398 1.7265 1.5099 1.6803 1.3812 1.6394 1.4520 2.1166 1.7218 1.5364 2.1419 1.7849 1.6804 2.5164 3.5210 1.3747 1.3270 1.5351 1.4971 1.9794 1.2656 1.2452 1.2513 1.8375 2.0018 4.4313 1.0888 1.0930 1.0471 1.0500 1.0477 1.0662 1.0613 1.1089 1.1723 1.1565 5.1821 6.1088 1.0668 1.0431 1.0412 1.0382 1.0378 1.0602 1.0973 1.0971 1.0956 1.0974 1.1018 1.0963 1.0959 1.0940 1.0925 1.0945 1.0662
irintensity: 1.6208 4.0269 0.4784 0.4403 2.3521 0.5787 1.0003 4.0827 15.6592 6.1788 0.8824 35.2984 1.1742 4.2491 105.9140 31.2997 40.0573 24.1715 0.6688 0.0018 0.6628 0.6180 1.0120 0.0262 4.8432 2.7428 15.2678 9.8332 4.7662 43.5557 3.7469 22.8250 6.5365 9.5125 0.5375 0.7397 3.7803 1.7672 8.3634 5.8904 3.7123 0.1361 9.7054 63.2982 41.0499 37.4178 0.9005 2.6968 15.8805 15.7661 21.8369 5.3881 9.3363 2.6853 0.0836 3.3006 0.6580 10.5660 41.5832 34.5454 8.0173 0.7006 6.1849 4.5759 41.7668 125.2168 82.6330 29.2579 78.7019 66.6271 29.6874 21.1982 65.6873 0.0999 19.9282 47.8686 17.4497 16.6074 31.1120 19.6439 5.1169
temp: 298.150 k
press: 1.00000 atm
elementType: 8 7 6 6 6 6 6 6 6 6 6 6 1 1 1 1 1 1 1 1 1 1 1 1 1 1 1 1 1
symmnumber: 1
zpe: 655489.0 jmol-1
zpe.correction: 0.249663 hartree
zpe.thermalcorrener: 0.264392 hartree
zpe.thermalcorrenthalpy: 0.265336 hartree
zpe.thermalcorrgfe: 0.208489 hartree
zpe.sumelectzpe: -520.280643 hartree
zpe.sumelectthermal: -520.265913 hartree
zpe.sumelectthermalent: -520.264969 hartree
zpe.sumelectthermalfe: -520.321816 hartree
dipole: 2.0213 0.6830 -2.1459
dipole: 3.0261
quadrupole: -66.9059 -67.9197 -79.3157
quadrupole: -0.0179 -7.9836 1.4760
quadrupole: 4.4745 3.4608 -7.9353 -0.0179 -7.9836 1.4760
hfenergy: -520.5303052 hartree
pointgroup: C01 [X(C10H17N1O1)]
dipole: 0.7844338 0.2651262 -0.8554338 debye
polarizability: 140.3253704|1.3091086|131.4597352|-11.3347528|0.15284|81.9217291 unknown
InChI: InChI=1S/C10H17NO/c1-7-8(2)10(4)11(5-6-12)9(7)3/h12H,5-6H2,1-4H3
charge 0 multiplicity 1
29 atoms
O  3.169489 -0.586253 1.121909
N  0.531323 0.190494 -0.452869
C  -0.048518 -1.087206 -0.310808
C  -0.437656 1.180003 -0.175563
C  -1.390636 -0.903907 0.054608
C  -1.635388 0.522662 0.140922
C  1.923836 0.476392 -0.803673
C  0.73215 -2.353534 -0.527718
C  -0.126695 2.648865 -0.268131
C  -2.42113 -1.97479 0.31654
C  -2.957775 1.15446 0.500016
C  2.878796 0.659186 0.400692
H  2.305398 -0.331753 -1.457023
H  1.950798 1.407919 -1.400979
H  0.066026 -3.223884 -0.407449
H  1.168888 -2.421148 -1.5454
H  1.554775 -2.459494 0.205688
H  0.692747 2.962288 0.409592
H  0.156243 2.965106 -1.29335
H  -1.018716 3.232877 0.012859
H  -1.993581 -2.98903 0.226969
H  -2.849046 -1.887228 1.334628
H  -3.269633 -1.910103 -0.39335
H  -3.315904 0.814295 1.491712
H  -2.893039 2.256522 0.534373
H  -3.748572 0.893572 -0.231091
H  3.819268 1.133584 0.041828
H  2.416796 1.315337 1.155478
H  3.640656 -1.207529 0.510289
