program: Gaussian 09
title: 000247475
version: EM64L-G09RevD.01
frameworkgroup: C1[X(C10H13NO)]
method: RPBEPBE
basis: SDD
operation: Freq
keyword: #p
keyword: freq=noraman
keyword: PBEPBE/SDD
title: #p freq=noraman PBEPBE/SDD
converged: YES YES NO NO
title: Mulliken charges:
elementType: O N C C C C C C C C C C H H H H H H H H H H H H H
charge: -0.215484 -0.015118 -0.025623 -0.502741 -0.712810 -0.714982 0.158578 0.005611 -0.268972 -0.191904 -0.367339 -0.161853 0.222049 0.242731 0.252756 0.196433 0.209788 0.246954 0.205093 0.216458 0.211155 0.282123 0.245440 0.246076 0.235578
chargesum: 0.00000
title: Mulliken charges with hydrogens summed into heavy atoms:
elementType: O N C C C C C C C C C C
charge: -0.215484 -0.015118 0.196427 -0.007253 -0.059634 -0.082275 0.158578 0.005611 0.013151 0.053536 -0.121263 0.073725
polarizability: 1.56793485e+02 4.60971270e+00 1.16105387e+02 -4.68372789e+00 -3.90290133e+00 6.92872570e+01
1716.lowfreq: -16.5034 -8.0629 -4.6961 -0.0010 -0.0008 -0.0007 27.6338 40.4780 89.0974
frequency: 27.2297 40.4360 89.0696 111.1228 147.6456 204.8430 213.9796 235.3869 277.2548 338.2525 383.7407 387.6400 411.0436 419.0384 486.6503 574.0968 610.4735 667.6582 747.3845 780.0407 789.0046 828.6474 876.4064 914.3711 918.7968 945.0627 960.8646 965.0597 973.3592 1012.7202 1015.7406 1037.3412 1082.8753 1099.0486 1138.1459 1159.5332 1181.3486 1210.1318 1224.5401 1280.6733 1294.6885 1321.3754 1327.5508 1354.5796 1373.3095 1391.2192 1412.2424 1414.3391 1444.7472 1466.0200 1470.4252 1480.6923 1488.8092 1557.4441 1569.8309 1602.6956 2964.7806 2965.9642 2971.4819 2994.3549 3026.8970 3056.8331 3064.6579 3069.1829 3085.0538 3131.1806 3145.1425 3164.8178 3175.9264
redmass: 2.8550 4.1066 3.0156 3.9950 4.7743 1.0532 2.2913 1.3612 3.4105 2.8739 2.6582 2.6997 2.5130 3.6769 4.9792 2.5589 7.4862 6.5337 2.3614 1.5483 5.2367 2.6448 1.8272 1.1876 1.3172 2.0445 1.5493 6.7910 1.4544 2.5397 1.3525 2.0530 1.6190 1.6567 2.2763 1.0912 1.7900 1.4231 2.1909 1.5826 1.8016 3.9765 1.7407 1.7918 1.2149 1.2218 1.4465 1.3900 2.1946 1.0548 1.0487 1.0557 1.0487 5.9101 5.8084 8.5243 1.0440 1.0542 1.0399 1.0833 1.0913 1.0991 1.0990 1.0986 1.0990 1.0884 1.0900 1.0947 1.1006
irintensity: 0.0439 3.4448 3.0359 3.3312 0.6825 0.1527 7.1530 2.0329 1.8671 3.3528 1.4128 3.1706 0.0986 1.1192 1.0979 6.8686 6.4886 15.9136 18.1976 63.6945 2.5680 3.4784 7.2104 6.1748 0.6800 30.4934 2.7728 11.2867 1.6037 26.2828 0.6900 1.3835 8.8317 5.1234 0.3484 2.4236 16.8300 7.9709 35.2953 3.6033 57.8058 1.7126 13.6368 76.5508 26.6024 5.8070 6.9076 42.6327 3.4143 5.7662 5.8500 6.1666 24.1798 27.1286 10.1981 60.8846 39.2047 33.4302 19.3018 5.2623 5.5431 15.2406 51.0441 83.3224 34.3577 9.7866 12.6443 11.2677 19.6221
temp: 298.150 k
press: 1.00000 atm
elementType: 8 7 6 6 6 6 6 6 6 6 6 6 1 1 1 1 1 1 1 1 1 1 1 1 1
symmnumber: 1
zpe: 541626.6 jmol-1
zpe.correction: 0.206295 hartree
zpe.thermalcorrener: 0.218361 hartree
zpe.thermalcorrenthalpy: 0.219306 hartree
zpe.thermalcorrgfe: 0.166919 hartree
zpe.sumelectzpe: -517.937291 hartree
zpe.sumelectthermal: -517.925224 hartree
zpe.sumelectthermalent: -517.924280 hartree
zpe.sumelectthermalfe: -517.976666 hartree
dipole: -3.0377 -1.2904 0.2514
dipole: 3.3100
quadrupole: -56.6377 -74.6027 -73.6889
quadrupole: -2.2864 -0.7556 0.4161
quadrupole: 11.6721 -6.2929 -5.3791 -2.2864 -0.7556 0.4161
hfenergy: -518.1435853 hartree
pointgroup: C01 [X(C10H13N1O1)]
dipole: 1.1942616 -0.5181748 0.0324478 debye
dipolederiv: -0.8075353 0.0660976 -0.0112002 0.2003499 -0.7752424 0.0119422 -0.0115274 0.0042728 -0.2976541 -0.2985352 0.0385602 -0.0016108 -0.0968243 -0.3191196 0.0067771 -0.0038257 0.0116336 -0.1903437 0.1905672 0.0183794 -0.0043198 -0.0510272 0.1012747 0.0082344 -0.0222602 -0.0203881 0.1363804 -0.2833358 -0.1450752 0.023475 -0.3578237 -0.2505312 0.0558751 0.0916135 0.0910333 0.0710015 -0.0169408 -0.0401787 -0.007825 -0.0081416 0.046662 0.0810953 -0.0001158 0.0816115 -0.0556634 -0.0362162 -0.0664548 0.0134604 -0.0288461 0.0388077 0.0469276 0.0080154 0.0648753 0.0494347 1.5771134 0.0120112 -0.012392 0.0202236 0.813086 -0.0273262 -0.0502209 -0.0344038 0.1215187 -0.3235896 -0.0311557 0.003316 0.1063029 0.0152813 -0.0062716 0.0075217 -0.0017058 0.0117494 -0.2786756 -0.0481618 0.0014574 0.0031453 0.0241658 0.0010535 0.0043518 -0.0022399 -0.0630937 0.1744878 0.1124088 -0.0108093 0.0756175 0.0933326 -0.0075477 -0.0109802 -0.0086075 -0.1264664 -0.092445 0.0515285 -0.0000119 -0.2099363 0.3919825 -0.0111585 0.0099033 -0.0168846 -0.0763363 0.0781414 -0.1353988 -0.0032345 0.0776114 -0.1830136 0.0020358 -0.0043994 0.0066584 -0.0955082 0.0620888 -0.0058549 0.0112696 0.0544007 -0.0710748 -0.0945117 0.0009258 -0.0787552 -0.0439362 0.0364906 -0.0049044 -0.0438736 0.05047 0.0766703 0.0641306 -0.0885245 0.0677428 -0.0662114 0.0520053 -0.0023962 0.0251619 0.0621555 0.0351892 -0.0714062 0.0406266 -0.1021034 0.0243685 0.0875746 0.0476781 0.0241846 0.0142844 -0.0868376 -0.1540564 0.002604 -0.0746206 -0.0279662 -0.1963748 0.097945 -0.0703746 0.0865404 0.0746399 0.0146646 -0.0384663 0.0030505 0.0610533 0.0357516 -0.1182464 0.0773807 -0.1079992 -0.0243182 0.0736017 0.0917378 0.037785 0.051992 0.0794753 0.0515444 0.0436386 -0.0150283 -0.0992831 -0.0893971 0.0141045 -0.1393706 0.0018604 -0.2182559 0.0331696 -0.0134127 0.0837708 0.053339 0.0106001 -0.04451 0.0127915 0.0933837 0.0928798 0.0049089 -0.0555506 -0.015514 0.050605 0.0702979 -0.0088647 0.084 -0.1796078 0.1497824 0.0463902 0.0006243 0.0121074 0.0015533 0.0036453 0.0026704 0.0025553 0.1571044 -0.0300501 -0.089502 0.0058729 -0.1005083 0.0154727 0.0056344 0.0071755 0.0054951 0.1485529 0.0546586 0.0380193 0.0005561 0.0841063 -0.1021904 0.0049199 -0.0019664 0.0045959 0.1344303 -0.0890624 0.0686878 0.0042175 0.0605631 0.079549 0.0002397 0.0044113 0.0009784 0.1599572 unknown
polarizability: 156.9573956|-5.164054|116.2042708|-0.0530497|-3.5670037|69.0244626 unknown
InChI: InChI=1S/C10H13NO/c1-8(2)7-10(12)9-5-3-4-6-11-9/h3-6,8H,7H2,1-2H3
charge 0 multiplicity 1
25 atoms
O  -0.77965 1.828739 0.059162
N  1.218342 -1.182203 0.085928
C  -3.010578 0.002324 -0.008007
C  -1.55948 -0.493488 0.182836
C  -3.272049 0.412288 -1.477393
C  -4.009617 -1.08576 0.449015
C  -0.499965 0.5948 0.088134
C  0.952623 0.163682 0.058974
C  1.972714 1.147854 0.009073
C  3.319635 0.73085 -0.016298
C  2.523876 -1.568724 0.062475
C  3.604029 -0.654816 0.010659
H  -3.147828 0.90278 0.623126
H  -1.433779 -0.971781 1.178299
H  -1.306493 -1.299852 -0.533102
H  -3.131979 -0.452146 -2.155898
H  -4.30833 0.776768 -1.60439
H  -2.589138 1.22005 -1.792861
H  -3.885303 -2.01205 -0.145209
H  -5.052763 -0.742206 0.320432
H  -3.866378 -1.345689 1.515067
H  1.681601 2.20225 -0.00856
H  4.13041 1.4657 -0.055647
H  2.70507 -2.64941 0.085597
H  4.634328 -1.023957 -0.00821
