program: Gaussian 09
title: 000247474
version: EM64L-G09RevD.01
frameworkgroup: C1[X(C10H13N)]
method: RPBEPBE
basis: SDD
operation: Freq
keyword: #pfreq=noraman
keyword: PBEPBE/SDD
title: #p freq=noraman PBEPBE/SDD
converged: YES YES NO NO
title: Mulliken charges:
elementType: N C C C C C C C C C C H H H H H H H H H H H H H
charge: -0.416154 -0.218465 -0.117422 0.304686 0.224780 -0.722896 -0.714866 -0.430565 -0.380654 -0.267955 -0.206102 0.224407 0.223652 0.271971 0.209989 0.220846 0.237141 0.236177 0.217260 0.210081 0.233576 0.224036 0.219482 0.216994
chargesum: 0.00000
title: Mulliken charges with hydrogens summed into heavy atoms:
elementType: N C C C C C C C C C C
charge: -0.144183 0.005943 0.106230 0.304686 0.224780 -0.054920 -0.051349 -0.196989 -0.156617 -0.048474 0.010892
polarizability: 1.46165640e+02 8.49576100e-01 1.10430728e+02 4.49635712e+00 1.22712509e+01 7.51607233e+01
1716.lowfreq: -12.5968 -6.5730 -0.0008 -0.0007 -0.0004 10.2760 61.1327 120.1197 187.4415
frequency: 61.1149 120.1154 187.4410 221.1829 243.4796 249.4790 307.2003 334.8087 411.5737 414.4093 452.8089 490.3975 547.5477 559.3864 597.6983 694.6043 735.7254 747.2203 763.5231 809.5185 841.9180 854.8189 920.5117 922.0464 960.7092 994.4950 996.0196 1018.9211 1036.9373 1070.2451 1097.1653 1117.8068 1135.0864 1165.9862 1176.2595 1202.5410 1265.2372 1285.6873 1293.7909 1301.4676 1338.3654 1366.7369 1379.6720 1384.7558 1423.2141 1458.3187 1469.4262 1470.5535 1473.3208 1476.2401 1487.3634 1602.8877 1625.1955 2971.2345 2974.5449 2997.5237 3002.3775 3066.3813 3070.8865 3079.7930 3083.4613 3117.0119 3123.4494 3140.4798 3160.3376 3563.5959
redmass: 3.1963 3.3422 3.1398 1.9240 1.1852 1.0779 3.2812 2.4673 2.1988 1.7237 2.6479 3.9000 3.9286 3.8845 4.6745 3.8339 2.1987 1.7400 2.7765 2.1298 1.4063 4.2535 2.0266 1.4133 1.2969 1.6095 1.6897 2.0749 2.4372 2.1494 1.7695 2.0128 2.0951 1.0902 1.9896 1.3066 1.7209 1.2995 1.7726 1.5603 1.3497 2.1727 1.2542 1.2225 2.6717 2.3002 1.0664 1.0666 1.0990 1.1166 2.8925 6.5073 7.3465 1.0353 1.0353 1.0865 1.0857 1.0992 1.0995 1.1005 1.1003 1.0858 1.0890 1.0939 1.0998 1.0780
irintensity: 0.6289 2.6745 0.6623 0.3912 0.1170 0.2718 4.4752 4.7884 60.4838 76.4070 31.8000 16.5792 1.7040 0.9336 4.3751 7.3976 28.2361 73.4900 1.2211 0.9407 1.6627 3.7749 0.6713 2.6134 0.0762 9.7238 9.6797 8.6258 10.8549 0.6289 15.7286 14.7801 0.9293 2.5883 12.0176 3.6986 28.8740 5.0673 9.5725 18.4423 5.4724 51.0492 19.3275 9.6534 3.9745 42.6951 11.0937 10.6264 2.0899 1.2978 97.1529 1.6282 90.2318 31.5047 33.6822 46.0647 26.7674 28.3440 37.7290 51.1466 31.7730 7.2288 9.6933 36.4086 29.4119 15.1292
temp: 298.150 k
press: 1.00000 atm
elementType: 7 6 6 6 6 6 6 6 6 6 6 1 1 1 1 1 1 1 1 1 1 1 1 1
symmnumber: 1
zpe: 537805.2 jmol-1
zpe.correction: 0.204839 hartree
zpe.thermalcorrener: 0.214854 hartree
zpe.thermalcorrenthalpy: 0.215798 hartree
zpe.thermalcorrgfe: 0.169949 hartree
zpe.sumelectzpe: -442.805299 hartree
zpe.sumelectthermal: -442.795285 hartree
zpe.sumelectthermalent: -442.794340 hartree
zpe.sumelectthermalfe: -442.840189 hartree
dipole: -1.9261 -0.7786 0.2197
dipole: 2.0891
quadrupole: -62.0401 -59.9927 -69.8590
quadrupole: 0.6797 0.1054 3.6942
quadrupole: 1.9239 3.9712 -5.8951 0.6797 0.1054 3.6942
hfenergy: -443.0101382 hartree
pointgroup: C01 [X(C10H13N1)]
dipole: -0.7602409 0.2974769 -0.0952508 debye
dipolederiv: -1.2092628 0.3084572 0.0909593 0.1936911 -0.2383583 -0.0286437 0.3580976 -0.1515641 -0.6690892 0.0466273 0.0905248 0.0380737 -0.0262057 0.0717663 -0.0111299 0.0684997 0.0324716 0.1544341 0.6204638 0.0299041 0.0973648 0.2998885 0.10314 -0.0347804 0.1569059 -0.0516879 0.3897445 -0.0160753 0.0170032 -0.0313475 0.5394665 -0.1590361 -0.0198371 0.1445093 -0.0099267 -0.1440604 1.0453983 -0.4684192 -0.2150199 -0.6401062 0.1287955 0.0528552 -0.3950442 0.1046032 0.1239015 0.0107163 -0.0268103 0.0097677 0.0328754 0.0107623 0.0732135 -0.0310526 0.0227718 0.0064858 -0.0350565 0.0329053 -0.0687953 -0.017519 0.046051 0.1121717 -0.1235561 0.0701106 -0.1033859 0.2519153 0.0533952 -0.0074747 -0.0794829 0.0866003 0.1032488 -0.0587238 0.0919956 -0.0991664 -0.3505818 0.2737166 0.0902375 -0.0775849 0.0171482 0.1097261 -0.0255657 0.0814798 -0.1817125 -0.2120966 -0.058928 -0.034273 -0.1316965 -0.2144725 0.0328886 -0.0572955 0.0134804 -0.2068108 0.1048924 -0.1020467 -0.059415 0.0814731 0.1554352 0.1111067 0.0080196 0.1353197 -0.0912315 -0.0201545 -0.0457233 -0.0562543 -0.0515821 0.0208545 -0.0445766 -0.0925741 -0.058836 -0.115299 -0.1578303 -0.0207981 0.0795261 -0.0549574 0.0563037 0.0290517 0.1015685 0.0314676 -0.0786977 0.101378 -0.0172804 -0.0163411 -0.0081508 0.0669285 -0.0482407 -0.1055509 0.0564019 0.3713222 -0.2028071 -0.116702 0.0341394 -0.075645 0.0466884 0.0231031 0.0279614 0.0407068 0.0675183 0.0348841 0.1350914 0.0157905 0.084431 -0.0985062 0.0122289 0.023028 -0.033016 0.0691427 0.0797592 -0.0207972 -0.0585224 -0.0094684 0.0497962 -0.1074063 -0.0431241 -0.0325117 -0.0838045 -0.0156237 -0.0294132 0.1346206 -0.0057863 0.076242 0.0028251 0.0862876 0.0213511 -0.0167899 -0.0780476 -0.0736981 -0.0799129 -0.1355307 -0.001485 -0.0654379 -0.1156887 -0.0141069 0.0421644 0.0489858 0.0893333 -0.0095288 0.1313627 -0.1443003 -0.0048603 0.0261486 -0.0548143 0.0532993 0.0899493 -0.0414365 -0.0167437 -0.0133512 -0.0887543 -0.0941781 -0.0022731 -0.0884495 0.1060962 0.0705274 0.0007038 0.0128703 -0.0286401 -0.0917129 -0.1060169 -0.0025228 -0.1087067 0.1254571 -0.0868938 0.0813294 0.0628067 0.0895417 0.0413733 -0.0664263 0.0654639 -0.0679567 0.1378302 -0.1210674 -0.0903113 -0.0125281 -0.0970226 0.0587404 -0.0308851 -0.0135186 -0.0305833 0.1426515 unknown
polarizability: 146.1749442|-0.6968088|111.1229353|-4.5923701|11.1528796|74.4592118 unknown
InChI: InChI=1S/C10H13N/c1-7-8(2)11-10-6-4-3-5-9(7)10/h3-8,11H,1-2H3
charge 0 multiplicity 1
24 atoms
N  -0.97317 1.252812 0.702925
C  -1.322768 -0.965307 -0.139612
C  -2.051649 0.408462 0.110645
C  0.150648 -0.559432 -0.196775
C  0.288915 0.752427 0.343765
C  -1.589496 -1.985559 0.997068
C  -2.620685 1.026728 -1.187239
C  1.281598 -1.276016 -0.612097
C  1.560618 1.355228 0.47809
C  2.567911 -0.680905 -0.491895
C  2.69484 0.619708 0.05124
H  -1.667441 -1.399528 -1.097659
H  -2.870125 0.277944 0.844848
H  -1.128854 2.249683 0.85388
H  -2.661971 -2.253561 1.04594
H  -1.009264 -2.912404 0.838033
H  -1.290269 -1.561352 1.972606
H  -1.821937 1.136182 -1.943546
H  -3.414436 0.3825 -1.609705
H  -3.05998 2.024687 -0.998658
H  1.179667 -2.28526 -1.029808
H  1.673847 2.361776 0.896645
H  3.45886 -1.226968 -0.819697
H  3.689141 1.073057 0.142407
