program: Gaussian 09
title: 000247464
version: EM64L-G09RevD.01
frameworkgroup: C1[X(C8H17NO3)]
method: RPBEPBE
basis: SDD
operation: Freq
keyword: #p
keyword: freq=noraman
keyword: PBEPBE/SDD
title: #p freq=noraman PBEPBE/SDD
converged: YES YES NO NO
title: Mulliken charges:
elementType: O O O N C C C C C C C C H H H H H H H H H H H H H H H H H
charge: -0.462787 -0.444825 -0.327367 -0.366890 0.152562 -0.411738 -0.464210 -0.391752 0.227065 -0.726463 -0.344752 -0.655649 0.259297 0.205134 0.242906 0.221640 0.191534 0.202124 0.250684 0.228975 0.199786 0.353296 0.213789 0.257070 0.358536 0.371075 0.232284 0.210750 0.217927
chargesum: 0.00000
title: Mulliken charges with hydrogens summed into heavy atoms:
elementType: O O O N C C C C C C C C
charge: -0.104251 -0.073749 -0.327367 -0.013594 0.152562 0.052693 0.000336 0.001905 0.227065 -0.047017 0.126107 0.005312
polarizability: 1.22930476e+02 -2.61701732e+00 1.01952827e+02 -1.04090877e+00 9.99527890e-01 8.69354321e+01
1716.lowfreq: -26.1543 -0.0012 -0.0005 -0.0004 8.8764 16.4919 23.0034 50.5057 60.8745
frequency: 21.0350 50.1238 60.5687 88.3853 134.5818 157.1070 161.5896 186.3385 226.1418 241.4414 251.6025 292.5916 294.4265 322.5251 340.5329 376.6908 391.2572 398.4851 445.3026 583.3745 622.0318 703.9782 741.6426 752.9916 761.1841 793.9948 840.6622 865.5341 892.0823 928.0486 934.7492 991.8503 999.7251 1015.7192 1034.0607 1065.9175 1085.4869 1099.8109 1150.2047 1155.4519 1166.4096 1178.6240 1235.1643 1273.6747 1288.8823 1290.1962 1331.1989 1342.5912 1345.0487 1356.0552 1378.3494 1388.5337 1390.9211 1418.7171 1459.0574 1466.3487 1468.9238 1471.3678 1476.1558 1479.2423 1481.7066 1490.2731 1544.4748 1586.9665 2936.9290 2971.6938 2984.4337 2984.8978 2993.7748 2997.7883 3044.5716 3048.9955 3066.4102 3069.6453 3082.0728 3086.8389 3086.8988 3097.8881 3308.5433 3355.9632 3578.0036
redmass: 2.4350 4.5185 2.6694 3.1981 4.4311 2.2047 2.0665 2.2837 1.4647 3.5088 1.5601 2.1469 2.7805 3.3075 2.8290 2.1607 1.8679 5.3105 2.9891 2.6050 3.1940 4.6862 1.1665 2.1065 1.3277 1.7253 1.1387 2.0082 2.2673 4.6451 1.4503 1.8315 2.0288 5.6310 2.4988 3.0617 1.7146 1.8913 1.9200 2.3544 3.3933 1.2457 1.5529 1.9438 1.1846 1.1592 1.2753 1.3184 1.3715 1.3047 1.2301 1.2150 1.2127 1.2032 1.0678 1.0746 1.0684 1.0552 1.0741 1.0543 1.0655 1.0562 1.7353 4.4901 1.0686 1.0404 1.0358 1.0640 1.0661 1.0637 1.0944 1.0930 1.0966 1.0981 1.1010 1.0977 1.0996 1.1017 1.0647 1.0817 1.0662
irintensity: 0.4461 2.0781 0.2300 0.5971 8.5126 1.4774 1.3017 11.2400 3.1269 5.5597 3.1065 2.7606 1.5406 3.7610 18.3060 48.4194 100.1674 10.0312 5.0970 0.5574 12.4800 7.9446 178.8206 5.2514 35.8865 2.1311 98.7923 7.5965 18.8842 68.9200 21.4003 11.8676 15.0020 39.7497 13.3709 2.2643 44.9453 22.8192 11.2472 24.5081 13.5546 1.8484 34.5349 81.2409 11.7811 2.2388 4.1846 13.4336 13.1838 1.6818 39.2951 17.7368 22.0705 142.6520 1.3345 6.0684 23.2293 5.9562 22.1396 10.1934 8.4103 6.1575 222.6653 139.7647 71.1541 27.3486 28.5784 23.8797 53.5076 45.9812 5.6998 47.3744 48.1013 6.7607 23.6703 43.9691 24.8676 31.5296 156.9499 196.9345 8.9522
temp: 298.150 k
press: 1.00000 atm
elementType: 8 8 8 7 6 6 6 6 6 6 6 6 1 1 1 1 1 1 1 1 1 1 1 1 1 1 1 1 1
symmnumber: 1
zpe: 654736.9 jmol-1
zpe.correction: 0.249376 hartree
zpe.thermalcorrener: 0.263911 hartree
zpe.thermalcorrenthalpy: 0.264855 hartree
zpe.thermalcorrgfe: 0.207390 hartree
zpe.sumelectzpe: -594.482292 hartree
zpe.sumelectthermal: -594.467757 hartree
zpe.sumelectthermalent: -594.466813 hartree
zpe.sumelectthermalfe: -594.524278 hartree
dipole: 0.9686 -4.6617 -0.2748
dipole: 4.7692
quadrupole: -71.0201 -84.3914 -71.6169
quadrupole: 7.8902 -1.0087 2.8418
quadrupole: 4.6560 -8.7152 4.0592 7.8902 -1.0087 2.8418
hfenergy: -594.7316681 hartree
pointgroup: C01 [X(C8H17N1O3)]
dipole: 0.1346536 -1.6674696 0.8497492 debye
polarizability: 121.8126065|-5.4553725|100.0062939|1.0094021|-6.3566003|89.9998347 unknown
InChI: InChI=1S/C8H17NO3/c1-3-8(5-10,6-11)7(12)9-4-2/h9-11H,3-6H2,1-2H3
charge 0 multiplicity 1
29 atoms
O  -0.364656 -1.683525 1.614626
O  -1.613681 2.460802 -0.975426
O  0.881368 1.486916 -1.185415
N  1.472026 -0.488835 -0.107595
C  -0.857349 0.351632 0.17061
C  -1.688721 -0.514167 -0.836557
C  -0.835177 -0.275759 1.590769
C  -1.473308 1.785052 0.305505
C  0.576286 0.501601 -0.420286
C  -3.142359 -0.816984 -0.408463
C  2.861945 -0.497071 -0.598468
C  3.885176 -0.266891 0.533605
H  -1.714849 0.040757 -1.791976
H  -1.146929 -1.460477 -1.037115
H  -0.12253 0.255712 2.243673
H  -1.841336 -0.212843 2.049064
H  -0.845241 2.380097 1.006004
H  -2.491746 1.718516 0.727723
H  -3.730833 0.11052 -0.301046
H  -3.639226 -1.432539 -1.1798
H  -3.210221 -1.373628 0.546922
H  1.140361 -1.234343 0.525926
H  3.059359 -1.46474 -1.099605
H  2.937096 0.301256 -1.355575
H  -1.063072 -2.263862 1.220801
H  -0.687651 2.44536 -1.367979
H  3.723751 0.71655 1.008349
H  3.807192 -1.046047 1.314074
H  4.913423 -0.291355 0.128852
