program: Gaussian 09
title: 000247466
version: EM64L-G09RevD.01
frameworkgroup: C1[X(C9H10N2O6)]
method: RPBEPBE
basis: SDD
operation: Freq
keyword: #p
keyword: freq=noraman
keyword: PBEPBE/SDD
title: #p freq=noraman PBEPBE/SDD
converged: YES YES NO NO
title: Mulliken charges:
elementType: O O O O O O N N C C C C C C C C C H H H H H H H H H H
charge: -0.266703 -0.429121 -0.283841 -0.147717 -0.173190 -0.233770 -0.182382 -0.393229 -0.088761 -0.040501 0.232778 0.026755 -0.380011 -0.099739 -0.309489 -0.052604 0.155592 0.284586 0.252244 0.266790 0.244338 0.224981 0.208089 0.362791 0.258585 0.211667 0.351861
chargesum: 0.00000
title: Mulliken charges with hydrogens summed into heavy atoms:
elementType: O O O O O O N N C C C C C C C C C
charge: -0.266703 -0.077260 -0.283841 -0.147717 -0.173190 -0.233770 -0.182382 -0.030438 0.195825 0.211743 0.232778 0.293545 0.089308 0.108350 -0.050905 0.159063 0.155592
polarizability: 1.60938924e+02 -1.86053776e+01 1.16608026e+02 -1.68478646e+01 -6.61619801e+00 1.07700733e+02
1716.lowfreq: -9.7282 -6.6752 -0.0009 -0.0009 -0.0007 1.8667 24.2760 37.1585 41.6648
frequency: 24.1765 37.1090 41.6497 62.5952 79.7833 102.3686 114.9672 143.7411 146.4125 173.2083 176.5451 202.0794 245.1948 284.5101 308.7869 326.3706 351.1940 377.7709 419.6116 428.5407 477.9359 513.6034 539.6235 595.3073 651.0038 672.7048 684.9417 709.2785 736.0761 749.4931 770.5534 788.5272 806.2219 890.9294 931.2430 936.6333 944.5614 961.2130 976.6602 1008.9797 1025.0496 1050.3000 1059.8793 1070.2946 1152.9292 1180.8006 1212.2088 1245.8376 1265.0124 1292.2460 1318.4317 1328.5122 1337.9806 1352.7128 1362.0911 1364.3716 1371.7916 1383.8744 1417.6782 1474.5269 1602.8177 1631.6102 1645.9775 1654.8581 1674.2299 2926.0693 2942.2532 2942.6998 2945.8478 3003.2123 3103.1736 3197.9258 3223.1417 3522.2056 3569.7917
redmass: 6.9133 8.1350 7.1650 8.5544 5.9511 2.8628 3.8757 6.3987 5.6669 6.2377 4.6642 4.6713 5.0832 7.9522 1.9977 1.7776 4.9639 8.3688 3.3104 4.3487 4.4910 6.7776 7.2893 6.5235 4.5600 4.0346 3.9435 2.1372 3.1823 7.8652 1.9004 3.6968 1.9884 1.3338 2.2939 1.5553 2.7095 5.2752 3.2520 3.4477 4.4306 3.2711 1.8508 2.2384 1.4824 3.7432 2.3855 1.8266 1.1785 1.3193 1.4585 3.0088 1.3340 1.2763 1.2687 1.2410 1.4337 1.4580 2.2643 1.0762 5.3879 10.2282 9.0113 9.0180 6.4200 1.0860 1.0832 1.0845 1.0830 1.0650 1.1015 1.0900 1.0999 1.0771 1.0668
irintensity: 2.3361 1.7619 3.6582 6.0156 3.8771 2.9142 6.5175 15.1409 5.7447 4.8924 3.9331 12.2178 2.7037 18.5647 81.3678 95.9451 20.2279 23.2356 19.7336 7.9619 8.6654 6.7303 29.1960 49.0062 29.3061 14.2518 3.2297 6.6213 1.5680 9.8512 54.3161 10.5228 107.8656 16.2061 3.2249 2.1800 3.3671 46.0074 116.8639 45.2329 137.6814 37.3472 65.0410 13.4248 12.6952 36.4134 38.6786 54.3703 7.0654 20.9753 11.7642 123.9011 17.3364 43.8647 2.4864 22.0199 12.5325 10.8941 82.3397 4.4791 87.9539 109.2090 165.4679 110.1902 749.2613 46.5695 13.3345 39.4407 90.8863 42.0403 12.3279 0.8633 0.4701 61.6433 14.7830
temp: 298.150 k
press: 1.00000 atm
elementType: 8 8 8 8 8 8 7 7 6 6 6 6 6 6 6 6 6 1 1 1 1 1 1 1 1 1 1
symmnumber: 1
zpe: 503893.7 jmol-1
zpe.correction: 0.191923 hartree
zpe.thermalcorrener: 0.208805 hartree
zpe.thermalcorrenthalpy: 0.209749 hartree
zpe.thermalcorrgfe: 0.145269 hartree
zpe.sumelectzpe: -908.493684 hartree
zpe.sumelectthermal: -908.476802 hartree
zpe.sumelectthermalent: -908.475857 hartree
zpe.sumelectthermalfe: -908.540338 hartree
dipole: -5.2075 1.5451 1.9016
dipole: 5.7552
quadrupole: -111.2294 -104.9610 -98.9677
quadrupole: -0.2017 -5.6609 -5.1779
quadrupole: -6.1767 0.0917 6.0850 -0.2017 -5.6609 -5.1779
hfenergy: -908.685607 hartree
pointgroup: C01 [X(C9H10N2O6)]
dipole: -1.9615472 -0.9295015 -0.6443747 debye
polarizability: 157.7912759|25.973178|108.7959689|11.5317127|-2.7985992|118.6604389 unknown
InChI: InChI=1S/C9H10N2O6/c12-3-6(4-13)17-8(5-14)11-2-1-7(15)10-9(11)16/h1-3,5-6,8,10,13H,4H2
charge 0 multiplicity 1
27 atoms
O  -1.713223 -0.51282 0.465023
O  -4.086461 1.08308 -1.947553
O  0.799108 -0.770545 -2.173538
O  0.578963 -2.718207 1.923489
O  -1.000729 2.200022 0.672623
O  4.234817 1.703361 -0.18856
N  0.733496 -0.44412 0.161954
N  2.508945 0.439255 -1.125812
C  -0.480853 -1.262655 0.232729
C  -2.10261 0.406041 -0.616149
C  1.324416 -0.288254 -1.125846
C  1.272746 0.179428 1.294827
C  -3.633354 0.243751 -0.83472
C  -0.455128 -2.316636 1.354805
C  2.430957 0.907367 1.247891
C  -1.764214 1.85943 -0.257705
C  3.15703 1.074916 -0.008242
H  -0.532098 -1.788423 -0.747511
H  -1.575255 0.145148 -1.561889
H  0.698518 0.062249 2.21483
H  -4.188886 0.599011 0.047431
H  -3.859566 -0.8291 -0.989617
H  -1.471352 -2.708558 1.594373
H  2.9658 0.550729 -2.037053
H  2.831415 1.389191 2.139439
H  -2.279792 2.606416 -0.908507
H  -3.85299 0.655825 -2.809812
