program: Gaussian 09
title: 000247446
version: EM64L-G09RevD.01
frameworkgroup: C1[X(C8H8ClN3)]
method: RPBEPBE
basis: SDD
operation: Freq
keyword: #p
keyword: freq=noraman
keyword: PBEPBE/SDD
title: #p freq=noraman PBEPBE/SDD
converged: YES YES NO NO
title: Mulliken charges:
elementType: Cl N N N C C C C C C C C H H H H H H H H
charge: 0.002179 0.080198 -0.693026 -0.015947 0.239023 0.198573 0.050584 0.361233 -0.816214 -0.503561 -0.801362 -0.254268 0.236075 0.276334 0.237531 0.229046 0.277572 0.228300 0.334051 0.333679
chargesum: 0.00000
title: Mulliken charges with hydrogens summed into heavy atoms:
elementType: Cl N N N C C C C C C C C
charge: 0.002179 0.080198 -0.025296 -0.015947 0.239023 0.198573 0.050584 0.361233 -0.066273 -0.503561 -0.066444 -0.254268
polarizability: 1.70400869e+02 -7.20594230e+00 1.31655715e+02 9.56200994e-03 1.88321072e-02 5.51281755e+01
1716.lowfreq: -4.6753 0.0012 0.0013 0.0027 5.2977 7.2450 68.0791 109.9448 134.7287
frequency: 68.0759 109.9439 134.7262 152.0896 164.7832 184.3986 218.2078 250.0030 288.5931 325.7310 349.6702 353.1243 382.9780 397.5361 425.3546 450.2178 476.4339 514.6967 561.3753 607.7446 642.8640 661.7981 762.1454 772.5836 885.5853 954.1349 1001.8647 1037.3065 1040.2652 1096.7595 1135.2686 1248.6856 1268.4365 1354.6485 1386.2743 1403.2175 1409.0077 1440.1551 1455.1542 1472.5928 1476.2134 1477.6591 1545.9509 1573.1561 1641.1098 2180.2487 2960.7784 2963.7752 3031.0839 3033.8421 3105.2170 3122.1650 3572.9427 3709.6416
redmass: 5.7172 2.8935 13.4655 3.3352 1.1101 1.1387 6.6024 4.6845 2.6952 2.9154 5.4452 13.2359 1.1768 1.1783 6.4974 5.6643 4.6256 5.0543 6.7955 3.9235 9.3501 7.8806 5.9151 4.3581 4.1850 1.9888 1.4791 1.5241 1.5223 3.1623 1.9884 5.5173 6.9510 5.1076 1.5353 1.2794 4.7001 4.1152 1.2435 1.0459 1.1542 1.0498 5.4017 5.5356 1.1966 12.6311 1.0403 1.0402 1.0972 1.0974 1.0954 1.0952 1.0452 1.1035
irintensity: 2.2310 0.2211 2.2019 1.7774 0.4081 0.9906 0.5484 2.9905 2.2832 0.9342 0.3129 6.0326 263.1347 11.5942 2.6498 3.1308 0.0010 10.3786 1.5358 0.4112 6.9215 0.1845 2.7423 22.9097 11.7576 48.6165 23.0479 2.7846 1.5532 1.8471 15.0966 2.9806 46.6865 11.2286 21.7230 27.6466 64.6796 175.8045 30.9068 22.6099 14.7979 13.1298 49.2389 19.6815 176.9958 25.8248 22.6779 18.4971 21.3934 14.7268 3.4874 3.6890 69.3498 30.8048
temp: 298.150 k
press: 1.00000 atm
elementType: 17 7 7 7 6 6 6 6 6 6 6 6 1 1 1 1 1 1 1 1
symmnumber: 1
zpe: 384229.9 jmol-1
zpe.correction: 0.146345 hartree
zpe.thermalcorrener: 0.158537 hartree
zpe.thermalcorrenthalpy: 0.159481 hartree
zpe.thermalcorrgfe: 0.108470 hartree
zpe.sumelectzpe: -933.101066 hartree
zpe.sumelectthermal: -933.088874 hartree
zpe.sumelectthermalent: -933.087930 hartree
zpe.sumelectthermalfe: -933.138941 hartree
dipole: 8.3068 1.8991 -0.0004
dipole: 8.5211
quadrupole: -74.0365 -77.9648 -78.3571
quadrupole: 8.0080 -0.0176 0.0089
quadrupole: 2.7496 -1.1787 -1.5710 8.0080 -0.0176 0.0089
hfenergy: -933.2474111 hartree
pointgroup: C01 [X(C8H8Cl1N3)]
dipole: 2.7833774 1.8686532 -0.005277 debye
dipolederiv: -0.4337335 -0.3945785 0.0010901 -0.4158037 -0.5618217 0.0013133 0.0011756 0.0011863 -0.0576238 -0.6686146 -0.3306619 0.0011872 0.1779654 -0.3608285 -0.0000086 0.0008916 0.0008642 -0.1667382 -0.8311466 -0.619537 -0.0007222 -0.7128945 -0.7590831 0.0012056 -0.0032895 -0.0015645 -0.6847799 -0.3956869 0.0964994 0.0000662 0.0621682 -0.2584929 0.0000105 0.0000372 0.0000843 -0.2394536 0.0716931 -0.446734 0.00014 0.1347314 0.2473497 -0.0000312 -0.0011798 0.0021787 -0.0548075 0.41127 0.9301784 0.000144 1.0914668 0.3528414 -0.0003626 0.0006665 0.0001815 0.1184886 0.6582341 0.0047555 -0.0008538 -0.5990431 0.1442923 0.0002154 0.0005884 -0.001366 -0.0242952 -0.2021721 0.0892183 0.0001468 -0.2125187 -0.0213714 0.0006157 0.0009182 0.0002295 0.147173 -0.0063371 -0.011694 -0.0006393 0.0069014 -0.1671922 -0.0003098 -0.0001492 -0.0027155 0.0798549 0.7488881 0.7472837 -0.0023064 0.4814861 0.7506155 -0.0019483 -0.00203 -0.0022479 -0.0364129 -0.2618282 0.0564232 -0.0001169 0.0253458 0.006289 -0.0004094 -0.0018686 0.0002803 0.0775808 0.3455276 -0.1767219 -0.0000753 -0.0830571 0.0762146 0.0000139 -0.0003318 0.0000709 0.0313661 0.0678015 -0.0522915 0.0991244 -0.0066604 -0.0050516 0.0546416 0.0544552 0.0919234 -0.0275966 -0.0528449 0.0722211 -0.0021639 -0.0152571 0.1144279 -0.0004166 -0.0014674 0.0006314 0.1190061 0.0717091 -0.0484676 -0.0960334 -0.0047495 -0.0050101 -0.0546657 -0.0526314 -0.0916816 -0.0305734 -0.0228708 0.0122822 -0.0624763 -0.0427382 0.0675955 -0.0976932 -0.1062227 -0.0493194 -0.0419878 0.1241819 -0.0314617 -0.0000877 0.0666667 -0.0584203 -0.000621 0.0003016 -0.0004866 0.1265055 -0.0230195 0.0115046 0.0627128 -0.0439821 0.066289 0.0988708 0.1068209 0.0498995 -0.0414466 0.2148234 0.058963 0.000534 0.0349843 0.1870276 -0.0004693 0.0019677 0.0009309 0.3539593 0.1841254 0.0328188 0.0003294 0.054988 0.1843293 0.0000488 0.0013475 0.0009206 0.3517813 unknown
polarizability: 170.2469097|7.6067056|131.8094718|-0.1070905|-0.0980191|55.128378 unknown
InChI: InChI=1S/C8H8ClN3/c1-4-6(3-10)8(9)12-5(2)7(4)11/h11H2,1-2H3
charge 0 multiplicity 1
20 atoms
Cl -1.725968 -2.649619 0.007426
N  0.776786 -1.619615 0.002307
N  2.360648 1.722378 -0.001297
N  -3.545797 0.645475 0.002446
C  -0.011171 1.105767 -0.000858
C  1.37201 0.742616 -0.001148
C  1.730152 -0.645882 -0.000118
C  -0.980329 0.058729 0.001992
C  -0.409813 2.564413 -0.002288
C  -0.511921 -1.28547 0.003682
C  3.175813 -1.081988 -0.00058
C  -2.383149 0.364794 0.002555
H  -0.005708 3.088538 -0.891374
H  -1.503479 2.688978 -0.013646
H  -0.02445 3.084848 0.897232
H  3.7154 -0.715354 0.895787
H  3.220962 -2.180862 -0.003609
H  3.716806 -0.710668 -0.89422
H  3.343036 1.46615 -0.005421
H  2.12277 2.709474 -0.00157
