program: Gaussian 09
title: 000247440
version: EM64L-G09RevD.01
frameworkgroup: C1[X(C8H5F3N2O)]
method: RPBEPBE
basis: SDD
operation: Freq
keyword: #p
keyword: freq=noraman
keyword: PBEPBE/SDD
title: #p freq=noraman PBEPBE/SDD
converged: YES YES NO YES
title: Mulliken charges:
elementType: F F F O N N C C C C C C C C H H H H H
charge: -0.159290 -0.143303 -0.143298 -0.213600 -0.390233 0.009602 0.250904 0.379185 -0.449213 0.111568 0.043403 0.270492 -0.779137 -0.187088 0.279592 0.350543 0.254750 0.254753 0.260369
chargesum: 0.00000
title: Mulliken charges with hydrogens summed into heavy atoms:
elementType: F F F O N N C C C C C C C C
charge: -0.159290 -0.143303 -0.143298 -0.213600 -0.039690 0.009602 0.250904 0.379185 -0.169621 0.111568 0.043403 0.270492 -0.009265 -0.187088
polarizability: 1.32903240e+02 -2.50381631e+01 1.37019641e+02 9.15350063e-03 -5.97528937e-03 5.30760083e+01
1716.lowfreq: -8.4798 -0.0005 0.0005 0.0011 4.0875 4.1898 26.5849 68.3622 86.2487
frequency: 26.2450 68.3620 86.2482 120.2360 121.6113 167.1420 173.0805 243.7855 262.4157 293.1508 313.0369 323.4799 411.9986 432.2595 444.6854 486.0900 504.9867 546.7056 597.6430 628.1115 636.8582 642.4843 710.1676 754.5604 794.9932 839.9812 850.6415 978.9823 1009.1156 1013.2140 1050.2353 1052.3796 1081.3016 1152.4470 1218.3257 1228.0925 1303.2811 1406.1573 1411.3073 1440.3587 1466.0234 1479.2341 1542.7839 1613.6340 1643.1200 2183.5163 2986.4313 3063.7373 3121.3925 3214.3108 3492.3745
redmass: 13.8070 9.5580 1.1237 4.4832 14.4925 4.9984 7.5717 5.0139 5.6338 9.7256 7.2963 10.3306 6.8404 9.2909 12.0913 14.2958 7.8299 7.6732 4.1020 9.2007 7.1506 4.9738 6.0806 2.4409 2.1244 10.5956 1.2884 2.8014 12.4231 2.4029 1.5404 7.4280 4.3002 8.7967 1.6047 8.4720 2.2202 1.2803 2.2220 2.4648 1.0426 1.3827 11.0350 4.7112 6.7419 12.6278 1.0393 1.0978 1.0974 1.0931 1.0773
irintensity: 0.6053 1.0479 0.1665 0.4599 0.9592 1.6543 1.1129 3.6121 1.7242 0.0057 4.7445 1.3289 2.7725 1.2772 2.3145 1.2693 1.5160 2.2906 3.3884 5.1121 12.5099 0.6190 3.0966 24.9201 71.3684 33.2182 34.7443 36.4111 216.0823 58.6699 22.8958 89.9930 56.0044 112.0930 61.2884 16.4705 41.4697 43.3114 56.0615 14.9113 18.8311 12.5224 45.4234 216.2954 356.4531 4.9781 11.3392 7.3909 7.3482 4.9853 60.1628
temp: 298.150 k
press: 1.00000 atm
elementType: 9 9 9 8 7 7 6 6 6 6 6 6 6 6 1 1 1 1 1
symmnumber: 1
zpe: 314813.6 jmol-1
zpe.correction: 0.119906 hartree
zpe.thermalcorrener: 0.132773 hartree
zpe.thermalcorrenthalpy: 0.133717 hartree
zpe.thermalcorrgfe: 0.079514 hartree
zpe.sumelectzpe: -791.100951 hartree
zpe.sumelectthermal: -791.088084 hartree
zpe.sumelectthermalent: -791.087139 hartree
zpe.sumelectthermalfe: -791.141343 hartree
dipole: 7.3520 -6.4622 0.0008
dipole: 9.7883
quadrupole: -70.8377 -94.6332 -79.4991
quadrupole: -5.4619 -0.0056 0.0048
quadrupole: 10.8190 -12.9765 2.1576 -5.4619 -0.0056 0.0048
hfenergy: -791.2208568 hartree
pointgroup: C01 [X(C8H5F3N2O1)]
dipole: -3.025249 2.3828916 0.0007557 debye
dipolederiv: -0.3962161 -0.1260937 -0.0000439 -0.0405188 -0.8115901 -0.0001387 -0.0000195 -0.0000989 -0.2813233 -0.5449705 -0.0920697 -0.2412607 -0.0187604 -0.3116644 0.0896359 -0.1966269 0.0634453 -0.6058422 -0.5449655 -0.0921939 0.2411719 -0.0188596 -0.3115525 -0.0895544 0.1965493 -0.0632737 -0.6058401 -0.4198682 -0.3440155 -0.0000163 -0.2783925 -1.1592224 0.0000083 -0.0000951 -0.0001963 -0.3428075 -0.3260985 0.4233912 0.0000518 -0.4897034 -0.6116014 -0.0000458 -0.0000181 -0.0000064 -0.262225 -0.240045 -0.0101966 -0.0004714 0.0426146 -0.1632835 0.000446 -0.0002416 0.0003799 -0.2170295 0.177799 -0.3937092 -0.000059 -0.4644339 0.4541012 0.0000496 -0.0001912 0.0001089 -0.0774756 1.0033777 -0.3891213 0.0000119 0.6492376 0.2506744 0.0000117 0.000159 -0.0000287 0.0871585 -0.9807264 0.5800971 0.0000494 -0.0472054 -0.2344704 -0.0000294 -0.000129 0.0000584 -0.2039005 -0.0830904 -0.5094451 -0.0000038 0.224823 -0.378681 -0.0000749 0.0000055 -0.0000122 0.0742706 0.3894347 0.3926081 0.0000399 0.3971092 1.5111817 0.0000431 0.000049 0.000335 0.2063803 1.5834267 0.4300254 0.0001626 0.129182 1.5075664 0.0000823 0.0001162 -0.000069 1.5173086 -0.201337 0.1694797 -0.0000121 0.0040519 -0.0164413 -0.0000003 -0.0000327 0.0000251 0.0466175 0.126778 -0.0203812 0.0003829 -0.127791 -0.0042954 -0.000397 0.0004488 -0.0006058 0.0603373 0.119484 0.0265426 0.0000083 0.0224194 0.0303529 -0.0000131 0.000043 -0.0000239 0.179012 0.2303057 0.0100717 -0.0000153 0.0109031 0.172559 -0.000014 -0.0000281 -0.0000224 0.309744 0.0135403 0.0221747 0.0706569 0.0049546 0.0707815 0.0665076 0.1118528 0.024611 -0.0063332 0.0136001 0.0221959 -0.0706354 0.0049926 0.0707939 -0.0664983 -0.1118363 -0.0245956 -0.0063926 0.0795714 -0.0993601 -0.0000174 -0.004623 -0.0652086 -0.0000187 -0.0000052 -0.0000308 0.1283408 unknown
polarizability: 135.6090072|-25.1142661|134.313868|-0.0122236|0.023418|53.0760142 unknown
InChI: InChI=1S/C8H5F3N2O/c1-4-2-6(8(9,10)11)5(3-12)7(14)13-4/h2,13H,1H3
charge 0 multiplicity 1
19 atoms
F  1.64159 2.543105 0.000816
F  2.409514 0.741044 1.13544
F  2.409583 0.741482 -1.134467
O  -1.558542 -2.663634 -0.000221
N  -2.306221 -0.452631 -0.000007
N  2.05784 -2.600578 -0.001627
C  0.264995 0.537577 0.00037
C  -2.143761 0.917217 0.000125
C  -0.84714 1.430632 0.000347
C  0.093743 -0.856553 0.000238
C  -1.265041 -1.437218 0.000097
C  1.662716 1.128359 0.000545
C  -3.388798 1.76724 0.000014
C  1.177759 -1.791505 0.000293
H  -0.690618 2.508629 0.000469
H  -3.250515 -0.856293 -0.000189
H  -4.010115 1.566155 0.892849
H  -4.009854 1.566303 -0.893035
H  -3.128535 2.836167 0.000141
