program: Gaussian 09
title: 000247445
version: EM64L-G09RevD.01
frameworkgroup: C1[X(C10H8ClN3O4)]
method: RPBEPBE
basis: SDD
operation: Freq
keyword: #p
keyword: freq=noraman
keyword: PBEPBE/SDD
title: #p freq=noraman PBEPBE/SDD
converged: YES YES NO NO
title: Mulliken charges:
elementType: Cl O O O O N N N C C C C C C C C C C H H H H H H H H
charge: 0.065691 -0.240825 -0.196322 -0.167805 -0.163906 0.085453 0.019886 0.006297 0.215554 0.136769 0.097650 0.371666 0.153474 -0.499639 -0.743852 -0.255338 -0.660571 -0.203684 0.243775 0.260168 0.274698 0.233486 0.243619 0.224372 0.248331 0.251055
chargesum: 0.00000
title: Mulliken charges with hydrogens summed into heavy atoms:
elementType: Cl O O O O N N N C C C C C C C C C C
charge: 0.065691 -0.240825 -0.196322 -0.167805 -0.163906 0.085453 0.019886 0.006297 0.215554 0.136769 0.097650 0.371666 0.153474 -0.499639 0.034788 0.221767 0.063187 -0.203684
polarizability: 1.93110510e+02 -1.11910549e+01 2.02220882e+02 4.27131647e+00 -3.10497863e+00 8.59921956e+01
1716.lowfreq: -0.0025 -0.0022 -0.0020 3.9865 5.0711 6.4695 28.0964 49.3176 52.6659
frequency: 28.0406 49.3138 52.6492 53.7016 73.9670 99.6640 115.7338 134.9618 146.3402 159.0887 173.5260 197.1041 219.3344 248.4891 261.8580 264.8679 289.3252 304.2648 331.0434 380.2803 424.8900 435.4080 457.7248 494.8022 516.4801 575.0291 605.4724 643.4662 678.4478 698.7985 701.2254 727.2899 764.4027 796.0512 809.8251 822.6067 887.8793 958.3369 996.9146 1026.1072 1041.6213 1096.1249 1108.0133 1159.1855 1187.9693 1214.9812 1250.5138 1272.8569 1317.0939 1340.5752 1359.5649 1366.3701 1397.0332 1400.6279 1402.3601 1449.4460 1456.8636 1461.0614 1464.4716 1485.2057 1500.0558 1560.3582 1621.9478 2191.7210 2998.2630 3004.4958 3038.9657 3084.1313 3093.4364 3103.8021 3130.3740 3135.2137
redmass: 6.0042 9.6885 4.0089 6.9175 3.4034 6.8624 4.5381 10.1050 1.1763 5.7713 8.3386 2.7671 1.8943 9.6141 6.6512 3.8524 3.7129 5.5306 12.8772 5.6117 5.4260 6.1260 6.5416 7.2348 8.0670 9.4855 10.7801 6.4837 7.9651 5.6973 11.2461 10.4601 4.3799 2.5346 6.6288 2.0701 5.0454 5.5333 2.3443 2.2318 1.5933 2.1730 6.2919 1.6828 8.6642 12.6758 7.6991 1.1248 7.3134 2.7343 2.0946 6.9458 1.2262 1.2133 9.8706 1.2303 1.0924 1.0964 1.0446 1.0545 5.0754 11.3983 10.2573 12.6299 1.0365 1.0378 1.0605 1.0961 1.0977 1.1022 1.1069 1.1006
irintensity: 1.7789 1.2724 1.5809 1.4579 1.1594 0.3528 0.6913 1.5201 1.0976 2.4811 1.5105 1.0885 4.5949 0.6426 5.9292 2.1093 5.4570 6.0160 5.6265 7.0248 2.9854 1.8275 12.0467 3.5183 4.1843 6.1702 6.6511 5.9477 15.8337 13.1035 0.4940 20.1848 2.7897 6.2487 7.3821 4.2866 27.8354 58.4391 44.9463 39.0218 3.7338 25.6683 46.2385 15.0502 255.1832 198.1912 47.4596 6.0802 46.4643 76.5159 83.1064 38.3578 29.0945 35.0618 121.4316 41.9449 18.7622 14.0407 16.9218 19.8469 55.4903 131.8656 154.3291 3.6520 11.6942 0.5938 20.9917 5.0796 25.1169 3.0545 20.2927 7.3174
temp: 298.150 k
press: 1.00000 atm
elementType: 17 8 8 8 8 7 7 7 6 6 6 6 6 6 6 6 6 6 1 1 1 1 1 1 1 1
symmnumber: 1
zpe: 450390.5 jmol-1
zpe.correction: 0.171545 hartree
zpe.thermalcorrener: 0.189534 hartree
zpe.thermalcorrenthalpy: 0.190479 hartree
zpe.thermalcorrgfe: 0.123858 hartree
zpe.sumelectzpe: -1309.659079 hartree
zpe.sumelectthermal: -1309.641089 hartree
zpe.sumelectthermalent: -1309.640145 hartree
zpe.sumelectthermalfe: -1309.706765 hartree
dipole: 0.2229 -0.3744 -1.4726
dipole: 1.5357
quadrupole: -94.1435 -130.1763 -111.9716
quadrupole: -3.7790 2.8454 3.0257
quadrupole: 17.9536 -18.0791 0.1255 -3.7790 2.8454 3.0257
hfenergy: -1309.8306232 hartree
pointgroup: C01 [X(C10H8Cl1N3O4)]
dipole: 0.064382 -0.358395 -0.4821306 debye
dipolederiv: -0.2176037 -0.2994675 0.1298209 -0.3172489 -0.6559173 0.2612463 0.1459574 0.2732217 -0.1321782 -1.3502205 0.0887602 -0.3265495 0.0470102 -0.2962316 0.0288266 -0.5552937 0.0387206 -0.7230971 -0.6813538 -0.0597733 0.195634 0.0478155 -0.2923366 0.0970993 -0.1725761 0.0459689 -0.8026981 -0.6317792 -0.189406 -0.1855911 -0.1837812 -0.5329063 0.0314148 -0.201043 0.0725191 -0.3710199 -0.3959164 0.0037752 -0.1823167 0.0520637 -0.5853741 0.2751264 -0.2492761 0.1873124 -0.4813091 -0.3758101 0.2845258 -0.0798089 0.0535164 -1.02348 0.2949403 0.0056231 0.2718093 -0.2696037 0.8197855 0.3577908 0.3962065 0.350322 1.1903162 -0.4426833 0.4099207 -0.3988837 0.759308 -0.230726 0.0030468 0.0065024 0.0170448 -0.2185866 -0.0010208 -0.010706 -0.0085225 -0.1986155 -0.0341012 -0.1468402 0.0231275 0.0369538 0.3947393 -0.1140952 -0.048508 -0.2105276 0.0636438 -0.4349378 0.1176029 -0.0601746 -0.1209745 -0.4053392 0.1798016 0.0810758 0.1914499 -0.07262 0.6969478 -0.2390064 0.0244748 -0.2337028 0.6289496 -0.1707126 0.0866896 -0.0971528 0.1103723 -0.2743379 -0.3298215 0.1694277 -0.1478055 -0.2341704 0.1652971 0.0338516 0.1128167 0.1026832 1.4342552 0.0600677 0.0654204 -0.1748325 0.3015002 -0.1706225 0.6866785 -0.0635724 1.2915174 0.6735374 0.292949 -0.1723411 0.4604523 1.3119494 -0.5070767 -0.2488429 -0.4991187 0.2394273 -0.1226995 0.1722384 -0.0756264 0.2395407 -0.2210941 0.0670781 -0.1820302 0.1433714 -0.0374056 0.977045 -0.0750131 0.1526182 -0.0198857 0.300913 0.0535558 0.0526842 0.0133081 0.2624242 -0.1498973 0.055269 -0.0214916 0.0587333 -0.1131972 -0.0636379 -0.0010486 -0.0213643 0.0108963 0.0969976 -0.0094833 0.0056178 -0.059492 0.0830472 0.0048253 0.0630445 0.0259508 0.0284806 0.0430928 -0.0507679 -0.0488359 -0.0347608 -0.0131867 -0.0599856 -0.0059905 -0.0739074 0.0867338 -0.0175937 -0.0078113 0.0478323 -0.0695103 0.0887556 0.0337831 0.1016299 -0.0026976 0.1016343 0.1039837 0.030012 0.0199401 0.0298673 0.1188808 0.0032324 0.0004673 -0.0237827 -0.0114421 -0.0077565 0.0074491 -0.0307149 0.0001421 0.0558521 -0.0601513 -0.0644015 -0.0868485 -0.0652636 -0.0044195 0.0228578 -0.0261919 -0.022128 -0.0283732 0.0510052 0.0651118 0.0995045 0.0331259 -0.1770737 0.0069946 -0.0156468 0.0120011 0.0952041 0.0031952 0.0028699 -0.0085588 0.1282695 0.1208743 -0.0271269 -0.0763302 -0.0005496 0.0567722 -0.0208319 -0.0636332 -0.0526433 -0.0696721 0.1397075 -0.0688221 0.0649967 -0.0207917 -0.0066864 0.0603905 0.0677456 0.0716268 0.0164086 unknown
polarizability: 191.6349168|-9.0442868|185.2976471|5.5714391|-43.032174|104.3910232 unknown
InChI: InChI=1S/C10H8ClN3O4/c1-3-18-10(15)7-6(4-12)9(11)13-5(2)8(7)14(16)17/h3H2,1-2H3
charge 0 multiplicity 1
26 atoms
Cl 2.585722 2.658484 -1.499524
O  -2.280662 -0.188777 -1.037088
O  -1.971008 -0.497322 1.264645
O  -0.731795 -2.962857 0.042704
O  0.972934 -3.105891 1.556539
N  2.724803 0.140355 -0.573214
N  0.33212 -2.508781 0.61373
N  -1.123248 3.048702 -1.324897
C  -0.056985 -0.191203 -0.206294
C  0.863655 -1.21323 0.123412
C  2.265687 -1.048352 -0.070776
C  0.453718 1.033613 -0.719232
C  -1.534623 -0.329091 0.104881
C  1.871301 1.121404 -0.868767
C  3.302188 -2.102297 0.214406
C  -3.780088 -0.232282 -0.883185
C  -4.316812 1.141936 -0.480377
C  -0.405799 2.132847 -1.053185
H  3.012323 -3.091679 -0.180372
H  4.256088 -1.786569 -0.232125
H  3.434415 -2.230282 1.303314
H  -4.116711 -0.541016 -1.884453
H  -4.02297 -1.009812 -0.138298
H  -5.421976 1.119874 -0.503991
H  -4.001058 1.410225 0.541315
H  -3.96952 1.9225 -1.17787
