program: Gaussian 09
title: 000002596
version: EM64L-G09RevD.01
frameworkgroup: C1[X(C10H7BrN2O2)]
method: RPBEPBE
basis: SDD
operation: Freq
keyword: #p
keyword: freq=noraman
keyword: PBEPBE/SDD
title: #p freq=noraman PBEPBE/SDD
converged: YES YES NO NO
title: Mulliken charges:
elementType: Br O O N N C C C C C C C C C C H H H H H H H
charge: 0.062703 -0.187847 -0.195946 -0.388326 0.007269 0.300527 0.353680 0.621815 -0.115897 0.068132 -0.741201 -0.300167 -0.455396 -0.330800 -0.590628 0.292317 0.309474 0.298447 0.255217 0.261234 0.214143 0.261251
chargesum: 0.00000
title: Mulliken charges with hydrogens summed into heavy atoms:
elementType: Br O O N N C C C C C C C C C C
charge: 0.062703 -0.187847 -0.195946 -0.078852 0.007269 0.300527 0.353680 0.621815 -0.115897 0.068132 -0.741201 -0.007850 -0.156949 -0.075583 0.146000
polarizability: 2.12261504e+02 -1.19486772e+01 2.02093459e+02 2.30013892e-02 -1.01790264e-01 5.70577304e+01
1716.lowfreq: -10.3804 -4.3570 -0.0007 -0.0001 0.0001 6.9462 45.8622 58.9943 120.4463
frequency: 45.8619 58.9932 120.4449 124.4251 159.4866 174.5795 186.8182 190.6624 238.3432 273.9945 297.6054 356.0816 370.3051 376.3482 435.6837 436.8547 484.5297 532.2275 537.2749 659.1534 664.4362 700.6276 712.9746 749.4929 770.6311 845.2763 863.5464 876.6422 925.1938 963.3324 995.1767 1019.2915 1068.5721 1105.5876 1107.8642 1149.7633 1182.7578 1223.9936 1272.4922 1299.1184 1314.3790 1381.1692 1401.5061 1433.8365 1455.5990 1458.2259 1464.2647 1477.2992 1520.1237 1541.7495 1562.5205 1580.3507 1597.3696 3002.8006 3094.5213 3109.0947 3146.2964 3156.3692 3178.1546 3463.5023
redmass: 5.9151 8.6899 4.4724 3.4594 10.4197 4.7721 1.2158 4.0774 10.2098 5.8303 6.8672 8.1248 3.4616 9.4156 5.2877 5.1933 8.1318 3.7753 8.7229 7.6439 1.5548 3.8013 7.2838 5.5864 8.0786 8.2698 3.8347 1.5144 6.3090 1.6770 1.4495 2.4894 2.9654 3.1473 1.2825 2.4709 2.0448 2.5801 2.9360 2.2228 9.0693 4.9415 2.2707 1.5297 2.2518 1.0427 1.2037 1.1067 11.0999 7.9762 6.3522 7.8167 4.7214 1.0331 1.1012 1.1030 1.0897 1.0928 1.0962 1.0758
irintensity: 7.0242 0.2039 1.2792 0.1677 0.2518 3.5920 0.1577 2.9021 0.9151 2.5464 1.3003 3.0709 0.1172 14.0903 4.2983 0.3119 3.5245 10.2900 16.3518 21.9829 84.7832 39.1558 1.5314 0.5191 52.2206 3.0516 5.1027 25.7589 41.2749 3.0313 1.5239 1.4803 12.9458 39.7822 0.8751 11.7653 25.9638 85.4231 127.3782 18.6907 11.0398 142.2623 37.5425 27.5415 1.0412 14.7504 12.2811 5.1239 129.7142 341.0798 221.4205 43.5585 145.6577 34.1617 16.8080 29.9361 16.6071 0.0674 5.5249 55.6322
temp: 298.150 k
press: 1.00000 atm
elementType: 35 8 8 7 7 6 6 6 6 6 6 6 6 6 6 1 1 1 1 1 1 1
symmnumber: 1
zpe: 400124.4 jmol-1
zpe.correction: 0.152399 hartree
zpe.thermalcorrener: 0.165495 hartree
zpe.thermalcorrenthalpy: 0.166439 hartree
zpe.thermalcorrgfe: 0.111536 hartree
zpe.sumelectzpe: -657.610902 hartree
zpe.sumelectthermal: -657.597807 hartree
zpe.sumelectthermalent: -657.596862 hartree
zpe.sumelectthermalfe: -657.651766 hartree
dipole: -2.3323 3.0157 0.0384
dipole: 3.8125
quadrupole: -94.7948 -97.1148 -96.1689
quadrupole: -17.2911 -0.0058 0.0802
quadrupole: 1.2314 -1.0886 -0.1427 -17.2911 -0.0058 0.0802
hfenergy: -657.7633014 hartree
pointgroup: C01 [X(C10H7Br1N2O2)]
dipole: 1.2977344 -0.7421609 0.1223424 debye
dipolederiv: -0.4546771 -0.4138616 0.0324203 -0.3415158 -0.3872172 0.0349715 0.0240169 0.0329207 0.0136675 -0.6484491 0.0170419 -0.0095527 0.1812423 -0.9938875 0.0752637 -0.0266803 0.070208 -0.2850596 -0.6195177 0.1782753 -0.0261273 0.4316209 -0.9350208 0.0757779 -0.0519737 0.0691019 -0.3206278 -1.0260964 0.8450132 -0.105077 0.1349102 -0.3698495 0.0016535 -0.0317449 0.0203698 -0.3882063 -0.413284 0.0363732 -0.0071244 0.0210982 -0.3129883 0.0065953 -0.0048967 0.007413 -0.2503121 -0.7707393 0.0054945 -0.0174062 0.0815941 -0.2073015 0.0271869 -0.0256168 0.0249769 0.0419432 0.1201735 -0.2259872 0.0247326 -0.164581 0.0181797 0.0003816 0.0179303 -0.0007651 0.0502464 0.4876168 -1.2346678 0.1386044 -1.0480765 -0.1029626 0.005102 0.1172476 0.0007351 0.205439 1.473455 0.3819587 -0.0118423 -0.0978932 1.2483289 -0.110314 0.0395171 -0.0988792 0.171639 1.2006447 -0.5256837 0.0787593 -0.6550712 0.7610939 -0.0761016 0.0906054 -0.0731066 0.1956254 -0.262848 1.1299767 -0.1196528 1.3830096 0.1456823 -0.0106132 -0.1436603 -0.0164464 -0.2710733 -0.5580708 0.0042701 -0.0107068 -0.2874064 0.0226683 -0.0146528 0.0192796 -0.0087828 -0.0596189 0.2481891 0.0342221 0.002064 0.0706833 0.2945552 -0.0312494 -0.001191 -0.0322694 -0.0238769 0.5174343 -0.1571117 0.027532 0.1586069 0.1509328 -0.0174669 -0.0052421 -0.0241293 -0.052471 0.3928908 -0.20345 0.0269694 -0.1083945 0.376338 -0.0197998 0.0193669 -0.0237124 0.2098033 0.1489899 -0.0271017 0.00279 0.0553832 0.0226863 0.0147265 -0.0056899 0.0133579 0.154709 0.230697 -0.0350804 0.0017291 0.0642661 0.1181423 0.019843 -0.0082742 0.0172832 0.2913694 0.1002791 0.0606713 -0.0068789 0.0283498 0.0206626 0.0120526 -0.0041322 0.0127966 0.1314502 -0.0812148 0.0686194 -0.0113248 0.0485725 0.0700774 0.0076445 -0.0091766 0.0080235 0.1345985 0.047032 0.0038808 0.073007 0.0598518 0.0097794 0.052877 0.0299774 0.0715997 -0.045917 -0.1868949 0.0620121 -0.0174696 -0.0749581 0.0695504 0.0028091 -0.0040169 0.0079561 0.1230327 0.0543897 -0.0048653 -0.0654452 0.0587078 -0.0194502 -0.0566876 -0.0356456 -0.0786511 -0.0263608 unknown
polarizability: 219.0967772|-4.5604429|193.6791899|4.1078507|-14.3042673|58.636726 unknown
InChI: InChI=1S/C10H7BrN2O2/c1-12-8-7(11)9(14)5-2-3-13-4-6(5)10(8)15/h2-4,12H,1H3
charge 0 multiplicity 1
22 atoms
Br 2.75306 2.517757 -0.126333
O  0.77576 -2.419722 0.332138
O  -0.319563 2.962372 -0.241637
N  2.941211 -0.583144 0.210058
N  -3.268846 -1.199073 0.128454
C  -0.874691 -0.678877 0.12417
C  -1.149767 0.705516 -0.022755
C  1.638945 -0.162939 0.130634
C  0.520009 -1.183271 0.205476
C  -0.041766 1.725494 -0.106041
C  1.311225 1.195662 -0.020491
C  -2.496167 1.121158 -0.092209
C  -1.963896 -1.587211 0.194042
C  -3.51297 0.142646 -0.012541
C  3.481149 -1.945622 0.370952
H  -2.723313 2.184469 -0.20595
H  3.628534 0.176505 0.148542
H  -1.77081 -2.658546 0.307159
H  -4.569472 0.427269 -0.062548
H  3.124085 -2.419474 1.299908
H  4.580195 -1.861813 0.403583
H  3.19039 -2.602256 -0.46541
