program: Gaussian 09
title: 000004116
version: EM64L-G09RevD.01
frameworkgroup: C1[X(C3H4Cl2F2O)]
method: RPBEPBE
basis: SDD
operation: Freq
keyword: #p
keyword: freq=noraman
keyword: PBEPBE/SDD
title: #p freq=noraman PBEPBE/SDD
converged: YES YES NO NO
title: Mulliken charges:
elementType: Cl Cl F F O C C C H H H H
charge: 0.066541 0.073081 -0.173609 -0.188596 -0.247483 0.523627 -0.662269 -0.494827 0.349474 0.251711 0.247228 0.255121
chargesum: 0.00000
title: Mulliken charges with hydrogens summed into heavy atoms:
elementType: Cl Cl F F O C C C
charge: 0.066541 0.073081 -0.173609 -0.188596 -0.247483 0.523627 -0.312794 0.259233
polarizability: 6.05279426e+01 -6.33150005e+00 6.34615262e+01 3.47399386e+00 1.17738783e+00 3.92952958e+01
1716.lowfreq: -14.4778 -0.0040 -0.0033 -0.0023 3.2765 7.1705 51.2765 80.8337 124.2913
frequency: 51.2273 80.7991 124.2770 149.8535 193.9895 227.0818 261.6427 317.9124 349.9567 455.5936 490.9852 631.6974 695.3720 733.8501 756.5588 908.9112 931.4915 1078.8144 1117.5565 1154.1580 1184.8290 1213.5647 1278.4412 1433.9451 1463.2171 1472.0529 3015.4022 3127.4412 3147.7256 3162.5924
redmass: 10.9864 1.6653 1.8833 4.2034 12.6436 13.9929 8.5672 11.0498 8.9571 12.2513 12.5253 6.9655 8.0091 8.7504 7.0119 6.6558 9.2927 5.7120 1.2565 1.5149 1.1119 2.3596 1.8894 1.1699 1.0504 1.0519 1.0290 1.1065 1.0880 1.1051
irintensity: 0.3781 4.3409 1.6008 3.1157 3.4370 2.3723 8.3703 6.5310 3.5404 5.2808 4.4769 21.2478 22.8821 117.7228 34.7946 160.9692 68.7421 213.7859 1.4032 56.8379 4.2775 112.5851 80.3215 16.1145 14.2111 19.9953 27.3272 16.3986 1.3086 8.9999
temp: 298.150 k
press: 1.00000 atm
elementType: 17 17 9 9 8 6 6 6 1 1 1 1
symmnumber: 1
zpe: 186682.9 jmol-1
zpe.correction: 0.071104 hartree
zpe.thermalcorrener: 0.080367 hartree
zpe.thermalcorrenthalpy: 0.081311 hartree
zpe.thermalcorrgfe: 0.035345 hartree
zpe.sumelectzpe: -1311.082730 hartree
zpe.sumelectthermal: -1311.073467 hartree
zpe.sumelectthermalent: -1311.072523 hartree
zpe.sumelectthermalfe: -1311.118488 hartree
dipole: -2.7586 0.7527 -1.3029
dipole: 3.1423
quadrupole: -49.8836 -63.3400 -59.5770
quadrupole: -1.6925 -1.1579 0.4361
quadrupole: 7.7166 -5.7398 -1.9769 -1.6925 -1.1579 0.4361
hfenergy: -1311.1538337 hartree
pointgroup: C01 [X(C3H4Cl2F2O1)]
dipole: -1.0993137 -0.296189 0.4818429 debye
dipolederiv: -0.1553358 0.0905627 0.0134865 -0.0058429 -0.585678 -0.0828026 -0.0137586 -0.1508029 -0.1131224 -0.3400388 -0.2801811 0.0185107 -0.1835134 -0.403515 0.0191176 0.0530306 0.0862279 -0.0871933 -0.4025106 0.0143462 -0.0221026 -0.0626189 -0.3068948 0.0701726 0.1333169 0.0741254 -0.8137506 -0.4415284 0.1658135 0.0464316 -0.0735573 -0.8100406 -0.1906962 -0.0127015 -0.1218805 -0.3657122 -1.4147862 -0.2483498 0.0599035 -0.3020793 -0.5269421 0.0047955 0.0543272 0.0190176 -0.4796079 1.5488902 0.0221657 -0.1407361 0.4095542 1.2213803 0.0856672 -0.1948856 -0.0240281 1.310384 0.4232039 0.2643153 -0.0871588 0.2365088 1.1235261 0.0731841 -0.1219137 0.0932925 0.1938587 0.7455632 0.0298264 0.0390585 -0.0659119 0.2200362 0.0402699 0.1278168 0.0524345 0.2728219 0.0209447 -0.0169028 0.0405551 -0.0100715 -0.0135591 -0.0109641 0.0201711 -0.0054431 0.0054175 -0.0000401 0.0072718 -0.0150419 0.1095206 -0.0506449 -0.062089 -0.0154228 -0.0714597 0.0816385 0.0024472 -0.0541934 0.0237013 -0.0857322 0.0191636 0.0713768 0.0431319 0.0741319 0.0833031 0.0131908 0.0053257 0.0233922 0.0337439 0.1131686 -0.0180317 -0.0731122 -0.0256155 -0.0880374 unknown
polarizability: 60.849953|6.4534382|63.1371781|-2.8234741|2.1955826|39.2976333 unknown
InChI: InChI=1S/C3H4Cl2F2O/c1-8-3(6,7)2(4)5/h2H,1H3
charge 0 multiplicity 1
12 atoms
Cl 1.51803 -1.901982 -0.095885
Cl 2.42812 1.004721 0.061701
F  -0.261883 0.383573 -1.436317
F  -0.514953 1.599706 0.469018
O  -1.240076 -0.61567 0.437588
C  -0.263199 0.248106 -0.004457
C  1.110101 -0.205171 0.526721
C  -2.632437 -0.332858 -0.015082
H  1.086627 -0.257793 1.621345
H  -2.939601 0.669324 0.325417
H  -3.236915 -1.113111 0.465301
H  -2.689012 -0.411046 -1.112451
