program: Gaussian 09
title: 000247429
version: EM64L-G09RevD.01
frameworkgroup: C1[X(C12H13N3O3)]
method: RPBEPBE
basis: SDD
operation: Freq
keyword: #p
keyword: freq=noraman
keyword: PBEPBE/SDD
title: #p freq=noraman PBEPBE/SDD
converged: NO YES NO NO
title: Mulliken charges:
elementType: O O O N N N C C C C C C C C C C C C H H H H H H H H H H H H H
charge: -0.294388 -0.373789 -0.286056 -0.440262 -0.335642 0.013983 0.210736 0.174038 0.083968 -0.418128 -0.334413 -0.235290 -0.255997 0.110580 -0.239808 0.076441 -0.682496 -0.236081 0.362148 0.306404 0.247637 0.232037 0.228317 0.211003 0.213727 0.340513 0.210203 0.236242 0.234318 0.251960 0.388095
chargesum: 0.00000
title: Mulliken charges with hydrogens summed into heavy atoms:
elementType: O O O N N N C C C C C C C C C C C C
charge: -0.294388 0.014306 -0.286056 -0.078114 0.004871 0.013983 0.210736 0.174038 0.083968 -0.111724 -0.086775 -0.003253 -0.027680 0.110580 0.184922 0.076441 -0.001733 0.015879
polarizability: 2.61123522e+02 -1.85129196e+01 1.89488920e+02 -4.65881993e+00 -5.90474905e+00 9.23294462e+01
1716.lowfreq: -5.3756 -2.8321 -0.0010 -0.0006 -0.0005 6.8411 35.6874 47.3308 64.4538
frequency: 35.6771 47.3177 64.4527 82.6175 106.4831 114.3551 156.7393 188.1605 214.4408 222.0749 240.4330 245.7483 287.6176 311.7810 327.2313 379.5089 398.7878 455.9330 465.5634 499.9480 525.5002 536.9989 543.5192 555.8660 590.4339 609.5505 632.2458 644.6920 708.5539 718.9365 735.7651 750.4842 753.6726 767.8661 813.7535 824.4803 854.4662 857.3707 874.0825 908.6299 926.8873 967.0635 1021.7084 1035.0528 1047.5883 1074.1436 1108.0023 1118.7920 1137.4881 1170.3472 1176.2246 1194.5523 1220.9345 1261.2360 1267.0384 1278.8062 1316.1229 1351.7075 1366.3408 1389.5485 1398.0493 1402.8080 1415.4785 1440.8077 1461.9085 1470.5124 1480.6325 1492.1735 1517.7972 1548.8557 1569.2682 1589.2301 1606.2944 1617.7966 2961.2133 2998.6952 3020.4334 3096.2585 3108.2354 3137.1137 3147.5920 3159.8768 3166.6684 3174.1953 3410.9623 3461.4757 3518.2352
redmass: 5.7749 4.5216 4.0585 5.2410 2.9532 2.4530 5.1847 5.8570 5.6183 5.2563 2.5582 1.6579 5.6264 4.4824 3.5184 5.9077 1.1703 4.5285 3.9631 5.5458 6.4439 7.3523 4.9158 3.9094 6.1485 4.0090 4.7754 1.4955 4.6771 2.5667 2.4975 1.9644 2.0449 5.0726 5.8858 1.1031 1.3869 1.3423 5.2851 3.4774 1.3248 1.2787 4.6919 2.7935 2.1336 2.7095 2.1808 2.0492 1.4416 1.4990 1.2431 2.4442 4.3577 1.1557 1.8189 2.7460 1.8016 1.6760 1.3510 2.3783 1.8824 1.8348 2.6899 2.5544 1.0395 1.6940 1.1609 1.1727 2.4686 6.9049 6.5163 5.6065 6.5243 6.4258 1.0554 1.0363 1.1078 1.0989 1.1016 1.0851 1.0895 1.0937 1.0935 1.1001 1.0665 1.0747 1.0783
irintensity: 0.7729 1.6947 0.9727 0.6451 0.3269 3.3838 1.7905 6.6943 6.6555 3.8272 1.3219 2.2378 1.6787 7.0594 5.9462 8.8402 130.5920 3.3923 4.7565 2.4412 3.4870 9.0102 9.9539 5.7092 8.7185 7.5637 28.1883 72.3077 5.1767 64.6167 34.8550 31.2356 105.9928 0.3409 4.0388 2.3503 7.2412 1.2124 8.1111 33.3326 1.9290 1.5884 21.5229 70.7495 11.4379 43.3753 55.3279 41.7375 5.2803 41.4039 5.7005 48.3167 252.4895 1.0258 26.9899 44.8153 14.3622 24.4620 16.8389 6.7566 21.2853 14.7968 18.3993 72.8395 13.2607 78.8445 1.1313 11.9490 133.3400 200.5359 262.7685 33.5170 154.9020 423.7826 45.3846 20.1952 31.6750 28.9774 30.9925 1.2841 11.2577 18.8051 2.7827 16.7942 137.5166 76.4298 57.0409
temp: 298.150 k
press: 1.00000 atm
elementType: 8 8 8 7 7 7 6 6 6 6 6 6 6 6 6 6 6 6 1 1 1 1 1 1 1 1 1 1 1 1 1
symmnumber: 1
zpe: 627165.5 jmol-1
zpe.correction: 0.238875 hartree
zpe.thermalcorrener: 0.255145 hartree
zpe.thermalcorrenthalpy: 0.256089 hartree
zpe.thermalcorrgfe: 0.194611 hartree
zpe.sumelectzpe: -853.699087 hartree
zpe.sumelectthermal: -853.682816 hartree
zpe.sumelectthermalent: -853.681872 hartree
zpe.sumelectthermalfe: -853.743350 hartree
dipole: 2.2882 1.2297 -0.5402
dipole: 2.6533
quadrupole: -74.3670 -107.8159 -112.3377
quadrupole: -6.9982 8.4536 8.1946
quadrupole: 23.8066 -9.6424 -14.1642 -6.9982 8.4536 8.1946
hfenergy: -853.9379613 hartree
pointgroup: C01 [X(C12H13N3O3)]
dipole: -0.8983889 -0.339995 -0.4086265 debye
polarizability: 261.9575259|-9.6138258|152.7242712|-14.5122571|46.9665144|128.2600905 unknown
InChI: InChI=1S/C12H13N3O3/c1-2-18-9-6-4-3-5-8(9)15-10-11(16)13-7-14-12(10)17/h3-7,13,15,17H,2H2,1H3
charge 0 multiplicity 1
31 atoms
O  -2.25537 -1.272686 -0.266368
O  1.721636 0.782353 2.136467
O  1.802915 -1.412811 -2.219215
N  0.204597 -0.300098 -0.266773
N  3.750064 -0.678671 -1.120591
N  3.688132 0.445144 0.975805
C  -0.799564 0.539577 0.240391
C  -2.139507 0.024414 0.258352
C  1.593282 -0.165006 -0.148914
C  -0.57623 1.869939 0.688161
C  -3.200458 0.802286 0.75796
C  -1.649409 2.644943 1.195284
C  -2.952069 2.112644 1.242372
C  2.340829 -0.792283 -1.244801
C  -3.605163 -1.866791 -0.361136
C  2.308273 0.343627 0.957535
C  -3.440218 -3.244378 -0.995976
C  4.363605 -0.055723 -0.045493
H  -0.099843 -1.044274 -0.907187
H  0.405498 2.333975 0.548101
H  -4.218595 0.402725 0.779859
H  -1.456892 3.667898 1.534484
H  -3.781341 2.709353 1.635444
H  -4.040083 -1.938941 0.656533
H  -4.249098 -1.207888 -0.97858
H  4.302692 -1.086778 -1.880813
H  -4.425458 -3.736172 -1.089448
H  -2.994338 -3.160899 -2.0016
H  -2.787839 -3.883783 -0.377504
H  5.455083 0.007659 -0.056502
H  0.727767 0.841249 2.065953
