program: Gaussian 09
title: 000247425
version: EM64L-G09RevD.01
frameworkgroup: C1[X(C10H8BrN3O3)]
method: RPBEPBE
basis: SDD
operation: Freq
keyword: #p
keyword: freq=noraman
keyword: PBEPBE/SDD
title: #p freq=noraman PBEPBE/SDD
converged: YES YES NO NO
title: Mulliken charges:
elementType: Br O O O N N N C C C C C C C C C C H H H H H H H H
charge: -0.000011 -0.198312 -0.172596 -0.210439 -0.433187 -0.366256 -0.374620 -0.282155 0.205722 0.126752 0.493396 0.194957 -0.420895 -0.346983 -0.149115 -0.173620 -0.242098 0.296066 0.308316 0.371955 0.375041 0.225824 0.275024 0.248640 0.248595
chargesum: 0.00000
title: Mulliken charges with hydrogens summed into heavy atoms:
elementType: Br O O O N N N C C C C C C C C C C
charge: -0.000011 -0.198312 -0.172596 -0.210439 -0.124871 0.005699 0.000421 0.013912 0.205722 0.126752 0.493396 0.194957 -0.195071 -0.071958 0.099525 0.074975 -0.242098
polarizability: 2.62955905e+02 -4.90438232e+00 1.22631010e+02 -1.47333804e+01 1.16218744e+01 9.77837753e+01
1716.lowfreq: -1.9001 0.0005 0.0006 0.0009 2.6565 10.4512 18.8410 35.7300 49.2937
frequency: 18.7244 35.7227 49.2799 76.4779 114.9155 131.5239 140.6621 172.5599 208.3842 249.8148 294.4629 308.0558 336.7045 354.2180 367.1517 409.6404 443.6447 464.9251 497.1104 507.2515 570.5263 599.6658 607.2004 626.3256 659.6861 684.9357 699.0961 721.7048 756.8012 792.9281 805.7619 820.4166 836.1042 905.5751 932.3994 940.6910 953.8320 985.1425 986.3422 1063.3375 1089.8092 1127.3881 1193.8467 1207.3981 1270.5816 1280.5303 1295.4972 1304.7155 1315.0018 1347.7475 1364.8667 1376.7747 1379.8137 1406.0766 1472.6272 1491.2945 1586.2456 1608.3250 1633.9462 1661.0083 1677.2673 3039.7769 3125.5411 3155.0203 3169.9266 3174.7784 3512.6222 3515.1875 3563.2508
redmass: 11.7268 9.8389 4.4439 8.9556 7.4122 9.4763 8.9477 10.5531 6.7751 5.2018 3.9835 4.7669 2.8856 10.4110 2.5448 2.9710 5.7300 9.5250 4.4927 3.5585 4.6900 6.1620 8.2147 6.8220 3.2019 2.7362 3.3566 6.7352 1.6259 1.6805 1.3413 1.5344 5.4565 4.5252 1.7517 2.1132 1.4705 3.5994 4.0534 2.8492 3.5524 1.4940 1.1180 5.8419 1.5525 1.6492 2.1899 1.4894 1.9368 8.8915 3.6934 1.7297 1.6732 3.7010 1.7941 2.0994 5.1845 6.1884 6.8186 9.7491 5.4413 1.0842 1.0898 1.0886 1.0951 1.0970 1.0759 1.0782 1.0771
irintensity: 0.1913 0.6306 0.2955 0.4241 1.7656 2.1483 5.2382 5.8238 0.6428 2.3781 12.1928 1.7655 23.8136 18.8413 86.7479 0.1839 7.6977 11.2323 31.7712 17.7551 10.4644 30.5207 8.9190 7.7051 10.5894 23.8942 0.6915 8.3289 7.7670 224.3556 24.9345 70.6553 5.4754 13.1789 0.5120 1.1487 0.2805 10.7943 30.9317 36.9885 12.3278 15.1695 9.6352 84.6737 45.9450 43.1129 334.8537 72.5451 88.6146 255.3974 29.7189 8.1817 3.2406 4.8104 42.6451 303.8498 2.6025 86.0694 316.8019 100.7754 637.7113 9.6080 13.7544 2.7865 6.5190 0.2633 91.5969 55.5491 26.7093
temp: 298.150 k
press: 1.00000 atm
elementType: 35 8 8 8 7 7 7 6 6 6 6 6 6 6 6 6 6 1 1 1 1 1 1 1 1
symmnumber: 1
zpe: 457431.5 jmol-1
zpe.correction: 0.174226 hartree
zpe.thermalcorrener: 0.189302 hartree
zpe.thermalcorrenthalpy: 0.190246 hartree
zpe.thermalcorrgfe: 0.129012 hartree
zpe.sumelectzpe: -788.076508 hartree
zpe.sumelectthermal: -788.061432 hartree
zpe.sumelectthermalent: -788.060487 hartree
zpe.sumelectthermalfe: -788.121722 hartree
dipole: 2.8327 -0.7967 -1.1265
dipole: 3.1508
quadrupole: -119.6774 -111.1606 -107.6089
quadrupole: 0.3146 2.6484 8.5993
quadrupole: -6.8617 1.6550 5.2067 0.3146 2.6484 8.5993
hfenergy: -788.250734 hartree
pointgroup: C01 [X(C10H8Br1N3O3)]
dipole: 1.0781494 0.2023727 0.5773591 debye
dipolederiv: -0.770604 -0.137263 -0.0738247 -0.1508593 -0.07314 -0.0224753 -0.091484 -0.0257173 -0.08041 -0.6521174 -0.0851039 -0.1701426 0.0177366 -0.6728776 -0.3545659 -0.2087547 -0.2657104 -0.6010679 -0.6005668 0.1006201 -0.081654 0.067992 -1.0756818 0.0955399 -0.1105099 0.0016074 -0.3236442 -1.2238925 0.1259139 -0.3112401 0.1595589 -0.5952357 0.0180362 -0.401784 0.007881 -0.5148618 -1.7519855 -0.1517868 -0.0139051 -0.1334205 -0.4738374 0.0659565 -0.0477964 -0.0478435 -0.2041834 -1.3608195 -0.4177182 -0.4587112 -0.0885728 -0.5691928 -0.153281 -0.6077725 -0.2833132 -0.6093259 -1.0636269 0.6522515 -0.139988 0.3533359 -1.0021788 0.0744304 -0.2970835 0.1683821 -0.3848247 0.3152139 -0.0645422 -0.1841468 -0.2113437 0.0448059 -0.0687025 -0.4378128 -0.16085 0.2767564 1.3932324 0.106967 0.5361643 -0.3767574 0.6060082 0.3024794 0.5786952 0.450668 0.6905689 1.3682326 -0.3976504 0.3582794 -0.0197644 1.2371954 -0.1462435 0.5721519 -0.1872614 0.2946482 1.7642505 0.25713 0.0913741 0.3506361 0.1340272 -0.043323 0.4285866 0.0590751 -0.0391118 1.7320354 -0.0995584 0.5251647 -0.0959786 1.697391 0.2315649 0.7708135 0.2646987 0.7019197 -0.4114535 -0.0370224 -0.0610484 -0.018037 -0.1895131 0.0656712 0.1649704 0.1091473 0.0397804 -0.3380462 -0.0266418 0.0397363 -0.1202589 -0.1778318 0.0933936 -0.321465 -0.0081364 -0.0654635 -0.1798564 -0.0321689 -0.0250077 -0.0316863 -0.0515982 0.0554629 -0.0224152 0.0437755 0.0892907 -0.1373392 -0.0291335 -0.0704674 -0.0077327 -0.0554977 0.0500629 -0.0371061 0.0468011 0.0908794 1.1385442 0.2613227 0.1729516 0.2772124 -0.1070127 0.0314135 0.1921151 0.0430649 -0.1251094 0.1018329 0.0400968 -0.0708391 0.0167158 0.0622199 0.0006063 0.0411815 0.0263023 0.0053859 0.0792316 -0.0392098 0.0328006 0.037187 0.279799 -0.0395781 0.0160883 -0.0148801 0.1316457 0.2064101 0.000905 -0.0747265 -0.0109421 0.2438274 -0.0406319 -0.1440667 -0.0562238 0.2754423 0.2158694 0.0428695 -0.045641 0.0879935 0.1944718 0.0048444 -0.076629 0.0146021 0.3165035 0.0156446 -0.0541011 -0.0857308 -0.0501274 0.1228103 -0.0902418 -0.0651249 -0.0745559 -0.0359812 0.0560404 0.0020521 0.0674608 -0.0241794 0.141235 -0.042153 0.0749971 -0.0188825 0.0611659 0.0226643 0.003764 0.0834867 0.0075928 0.1507816 -0.0257748 0.0822754 -0.0307 0.0190007 0.0811058 -0.0219922 -0.0403451 -0.0363006 0.129025 -0.0624915 -0.0520702 -0.0619311 -0.009004 unknown
polarizability: 259.8071847|17.7234419|108.4379851|17.7085948|19.109441|115.1255206 unknown
InChI: InChI=1S/C10H8BrN3O3/c11-5-1-3-6(4-2-5)12-7-8(15)13-10(17)14-9(7)16/h1-4,7,12-14H
charge 0 multiplicity 1
25 atoms
Br -5.96802 -1.026175 -0.305689
O  1.223717 -1.705675 -1.620384
O  1.644665 2.835662 -0.11861
O  4.858326 -0.359446 0.960537
N  0.039963 0.25417 0.55659
N  2.96852 -1.057411 -0.228846
N  3.198077 1.206062 0.452897
C  1.018391 0.484874 -0.509924
C  1.733523 -0.838811 -0.868773
C  1.962129 1.623321 -0.076124
C  -1.318597 -0.052893 0.329922
C  3.747847 -0.097226 0.441533
C  -2.247278 0.12239 1.394085
C  -1.785173 -0.54424 -0.919896
C  -3.613279 -0.170021 1.212735
C  -3.156842 -0.820042 -1.106657
C  -4.060714 -0.631081 -0.043215
H  0.49108 0.82712 -1.418506
H  0.312202 0.501832 1.507895
H  3.394433 -1.985846 -0.323895
H  3.808728 1.93176 0.844458
H  -1.906018 0.503872 2.364181
H  -1.084099 -0.765128 -1.729863
H  -4.317575 -0.026842 2.037152
H  -3.506107 -1.199527 -2.0712
