program: Gaussian 09
title: 000247423
version: EM64L-G09RevD.01
frameworkgroup: C1[X(C13H15N3O2S)]
method: RPBEPBE
basis: SDD
operation: Freq
keyword: #p
keyword: freq=noraman
keyword: PBEPBE/SDD
title: #p freq=noraman PBEPBE/SDD
converged: YES YES NO NO
title: Mulliken charges:
elementType: S O O N N N C C C C C C C C C C C C C H H H H H H H H H H H H H H H
charge: 0.231229 -0.376340 -0.288195 -0.467887 -0.330113 0.071204 0.411656 0.363720 0.309894 -0.674911 -0.473168 -0.390720 0.056848 -0.819344 -0.808979 0.090134 0.075541 -0.238974 -0.801917 0.316316 0.337295 0.242576 0.231690 0.236158 0.228028 0.229607 0.226031 0.228963 0.225970 0.345452 0.387496 0.243460 0.290477 0.290804
chargesum: 0.00000
title: Mulliken charges with hydrogens summed into heavy atoms:
elementType: S O O N N N C C C C C C C C C C C C C
charge: 0.231229 0.011156 -0.288195 -0.130593 0.015339 0.071204 0.411656 0.363720 0.309894 -0.358595 -0.230592 -0.159030 0.056848 -0.125551 -0.128015 0.090134 0.075541 -0.238974 0.022825
polarizability: 3.42247973e+02 1.00342151e+01 1.97385937e+02 -1.04925210e+01 5.26196805e-01 1.06611283e+02
1716.lowfreq: -11.2399 -6.1213 -0.0010 0.0012 0.0017 1.6116 31.0971 41.1053 45.7113
frequency: 31.0437 41.1017 45.6895 56.9022 90.1769 91.4627 111.1895 125.4053 138.3775 157.4094 165.7214 200.3186 210.7451 233.9456 247.5491 282.9470 288.9069 321.3786 332.4597 363.8475 405.0469 431.3424 452.9061 459.5658 499.2137 522.6492 543.8753 557.5473 570.4950 586.5456 596.2803 619.9681 625.2559 662.8126 704.9991 711.4491 730.7377 739.0525 757.9222 790.0830 821.1687 904.8455 927.7554 945.5515 947.2919 987.5596 989.6999 995.9477 1007.7859 1031.1211 1049.1870 1052.4351 1104.7146 1128.2631 1177.3843 1210.4681 1213.6856 1237.4236 1273.3580 1287.5237 1301.3308 1345.7611 1377.4576 1385.2644 1394.4322 1404.2878 1415.4198 1419.4899 1432.2737 1449.9889 1460.2162 1467.7097 1472.6570 1477.3777 1493.3242 1515.5985 1545.5853 1560.9887 1582.8945 1611.6663 1623.9168 2966.3988 2972.6354 3029.8962 3037.1668 3046.1824 3081.8089 3088.5958 3120.9609 3128.3589 3146.7252 3157.4906 3165.1128 3355.6836 3464.0774 3509.8069
redmass: 5.0469 3.2400 4.1472 4.0424 1.3201 1.0628 3.5365 2.6262 1.2273 3.5963 7.7769 5.4677 6.7541 3.5600 5.1942 5.5294 2.6363 5.5500 4.1122 6.2176 3.5342 1.3574 3.5850 3.1426 5.9707 6.6694 7.8551 3.7017 2.6278 3.8582 2.5890 3.7922 5.3132 7.4688 1.8746 3.3734 3.6567 4.7575 3.9795 6.8374 1.5015 10.0095 1.2917 2.3441 1.3765 1.1753 1.6068 1.3165 1.5851 1.4545 4.2936 1.6418 3.0270 1.9384 1.8046 1.9217 2.6186 2.8026 1.8718 2.1841 2.7108 1.1364 5.2270 2.8931 1.2557 1.3461 2.3778 2.4731 1.0513 1.0676 1.0487 1.2704 1.0487 1.1527 1.8798 2.5573 5.5552 8.6520 5.3228 6.3190 6.2659 1.0380 1.0381 1.0279 1.0971 1.0968 1.0979 1.0982 1.0875 1.0906 1.0968 1.1046 1.1061 1.0668 1.0750 1.0779
irintensity: 0.9409 1.4240 1.4707 0.6938 0.6045 0.0859 0.3188 3.5828 1.7057 0.2649 4.8498 7.6560 2.0203 11.8046 1.7874 2.2464 0.2647 4.4206 7.9652 29.8773 16.6381 92.9199 9.1924 1.8800 2.6655 1.8594 3.6139 28.1164 60.8687 20.0576 35.9228 10.3741 21.9511 6.0195 61.3218 10.2119 11.4838 26.1118 7.1676 13.7054 46.1503 33.6307 3.9112 1.6173 0.7598 8.9804 5.1121 4.6142 17.2760 13.4771 18.5253 1.3248 9.9958 18.5614 11.6144 61.8601 81.4943 41.1527 18.4729 28.5890 10.4513 4.5638 34.3634 70.5793 5.0128 14.1835 0.9896 61.8598 15.1877 11.5663 0.1625 64.1987 28.6801 1.6100 9.9593 417.9646 265.8982 340.0535 106.9149 461.9450 130.8573 62.0029 24.0780 18.3479 31.1583 9.7422 26.9833 12.4769 20.5741 6.4118 16.2185 6.7457 6.9297 261.0657 75.5062 54.5978
temp: 298.150 k
press: 1.00000 atm
elementType: 16 8 8 7 7 7 6 6 6 6 6 6 6 6 6 6 6 6 6 1 1 1 1 1 1 1 1 1 1 1 1 1 1 1
symmnumber: 1
zpe: 686692.6 jmol-1
zpe.correction: 0.261547 hartree
zpe.thermalcorrener: 0.280895 hartree
zpe.thermalcorrenthalpy: 0.281840 hartree
zpe.thermalcorrgfe: 0.212833 hartree
zpe.sumelectzpe: -1215.784775 hartree
zpe.sumelectthermal: -1215.765427 hartree
zpe.sumelectthermalent: -1215.764483 hartree
zpe.sumelectthermalfe: -1215.833490 hartree
dipole: 1.1106 -2.1116 0.1241
dipole: 2.3891
quadrupole: -94.1581 -122.4682 -122.9425
quadrupole: 3.8506 -0.8130 -6.8593
quadrupole: 19.0315 -9.2786 -9.7529 3.8506 -0.8130 -6.8593
hfenergy: -1216.0463227 hartree
pointgroup: C01 [X(C13H15N3O2S1)]
dipole: -0.4281439 -0.7978635 0.2521853 debye
polarizability: 341.0713492|-14.77025|186.9640707|-17.0093964|-28.3656504|118.2097729 unknown
InChI: InChI=1S/C13H15N3O2S/c1-7-4-5-9(6-8(7)2)14-10-11(17)15-13(19-3)16-12(10)18/h4-6,14-15,18H,1-3H3
charge 0 multiplicity 1
34 atoms
S  5.280444 -0.793509 -0.428809
O  0.562231 -0.920753 1.374639
O  1.722914 2.521685 -1.875636
N  -0.308646 1.386501 -0.418208
N  3.264486 0.914253 -1.123025
N  2.658644 -0.783612 0.419174
C  -1.569146 0.783054 -0.21954
C  -3.035598 -1.215303 -0.13717
C  -4.148463 -0.39595 0.21313
C  -1.765012 -0.622961 -0.354131
C  -2.686515 1.597879 0.107768
C  -3.946378 1.005604 0.309324
C  0.955933 0.778088 -0.382846
C  -3.199708 -2.715209 -0.302201
C  -5.520949 -0.996553 0.457412
C  1.960504 1.474626 -1.188348
C  1.3735 -0.28059 0.449014
C  3.559822 -0.195863 -0.344754
C  5.169669 -2.190867 0.823518
H  -0.954492 -1.24754 -0.7478
H  -0.283726 2.328138 -0.828209
H  -2.556367 2.680436 0.217884
H  -4.79867 1.647104 0.563822
H  -2.242486 -3.200628 -0.555644
H  -3.581843 -3.184845 0.624442
H  -3.926004 -2.95666 -1.102073
H  -5.506114 -1.730595 1.286361
H  -6.256882 -0.215737 0.714192
H  -5.898386 -1.533795 -0.43431
H  3.983206 1.381327 -1.685381
H  -0.403853 -0.693285 1.247067
H  6.176116 -2.635833 0.852536
H  4.418667 -2.91949 0.490454
H  4.8843 -1.781118 1.801647
