program: Gaussian 09
title: 000247422
version: EM64L-G09RevD.01
frameworkgroup: C1[X(C11H9Cl2N3O2S)]
method: RPBEPBE
basis: SDD
operation: Freq
keyword: #p
keyword: freq=noraman
keyword: PBEPBE/SDD
title: #p freq=noraman PBEPBE/SDD
converged: YES YES NO NO
title: Mulliken charges:
elementType: Cl Cl S O O N N N C C C C C C C C C C C H H H H H H H H H
charge: -0.006312 -0.006238 0.244057 -0.368586 -0.280904 -0.462606 -0.329822 0.073153 0.050357 0.424934 0.096719 0.082835 -0.399018 -0.460565 -0.237997 -0.056448 -0.166376 -0.152745 -0.799306 0.341500 0.330983 0.250545 0.349867 0.260238 0.390065 0.246600 0.291945 0.293125
chargesum: 0.00000
title: Mulliken charges with hydrogens summed into heavy atoms:
elementType: Cl Cl S O O N N N C C C C C C C C C C C
charge: -0.006312 -0.006238 0.244057 0.021479 -0.280904 -0.121106 0.020045 0.073153 0.050357 0.424934 0.096719 0.082835 -0.068035 -0.210020 -0.237997 -0.056448 0.093862 -0.152745 0.032364
polarizability: 3.42737312e+02 -1.49644095e+01 1.98711699e+02 -1.19111401e+01 -3.08458707e+00 9.58922129e+01
1716.lowfreq: -5.2103 -2.9693 -0.0013 -0.0012 0.0019 7.0095 26.6879 36.9362 42.9714
frequency: 26.6850 36.9181 42.9656 59.4008 92.0925 106.6734 113.2716 148.5016 164.5839 180.5614 188.5979 202.9476 210.6861 226.2853 281.5695 304.1650 322.6139 350.9638 359.3119 381.6097 416.9020 423.4232 453.8990 485.8596 523.9621 549.5982 565.3167 579.1713 593.1042 605.5527 630.1779 655.4599 660.2195 681.7824 701.4225 707.8938 742.2367 781.0336 811.3113 886.6140 897.4190 911.1517 946.2996 988.7174 993.6907 997.1135 1046.5491 1102.4990 1121.3720 1146.1700 1199.8362 1209.8220 1246.5956 1276.9048 1291.8217 1346.7945 1371.8746 1383.3048 1402.3225 1416.9328 1433.7112 1449.0680 1464.7989 1506.9090 1545.0147 1559.9460 1567.0070 1607.2932 1615.7206 3031.4130 3146.5399 3159.3922 3164.7807 3167.8979 3174.9624 3450.2114 3455.9297 3507.9343
redmass: 9.9880 10.9143 5.1324 3.9112 4.7272 1.6567 3.3307 4.1598 7.1866 22.7490 6.5078 11.8031 6.6473 7.0330 6.4363 7.0199 4.1711 7.7502 6.8686 1.4029 5.4661 8.3896 3.4730 6.8623 9.8934 7.9917 3.5015 3.7301 3.2088 2.9958 5.2485 6.7119 7.5007 4.6811 4.3515 1.7745 4.9966 6.5710 1.5045 4.0235 1.6264 5.0033 1.3491 1.1747 5.1160 1.2988 4.9203 3.2230 2.2324 1.3972 1.8457 3.5946 1.4703 3.2287 2.5795 1.1394 4.5213 3.2243 4.6395 2.3096 1.0509 1.0717 2.4365 2.6153 6.1976 10.4096 3.9090 6.8438 6.2813 1.0279 1.0895 1.1046 1.0917 1.1062 1.0962 1.0670 1.0743 1.0780
irintensity: 0.1389 0.6608 2.8278 1.5220 0.6619 1.7984 1.7793 0.2963 3.5954 0.9436 2.7846 0.9951 17.6632 1.7861 1.9616 2.6746 12.5309 8.5349 19.4390 102.0156 41.1708 3.6261 2.4871 9.5785 1.7517 1.3338 51.4831 51.7191 27.9278 22.9587 22.8525 14.6247 12.4135 2.3237 23.6365 54.6265 49.4469 20.6334 49.6958 15.3013 12.8325 37.0326 0.0945 8.5738 18.7833 9.7405 14.1822 25.3997 59.8542 8.2993 94.3246 106.8940 6.5356 35.8101 16.3045 4.5559 53.4799 91.2566 20.3331 5.5852 15.5761 15.8287 71.5735 577.5131 407.9451 131.8950 113.7260 285.2893 408.0868 15.4096 4.1375 5.9148 0.9450 6.0003 2.9151 105.8916 140.2091 57.5921
temp: 298.150 k
press: 1.00000 atm
elementType: 17 17 16 8 8 7 7 7 6 6 6 6 6 6 6 6 6 6 6 1 1 1 1 1 1 1 1 1
symmnumber: 1
zpe: 493824.8 jmol-1
zpe.correction: 0.188088 hartree
zpe.thermalcorrener: 0.206582 hartree
zpe.thermalcorrenthalpy: 0.207526 hartree
zpe.thermalcorrgfe: 0.139489 hartree
zpe.sumelectzpe: -2056.099869 hartree
zpe.sumelectthermal: -2056.081375 hartree
zpe.sumelectthermalent: -2056.080431 hartree
zpe.sumelectthermalfe: -2056.148468 hartree
dipole: 2.7838 0.6417 0.8846
dipole: 2.9906
quadrupole: -122.3714 -132.3947 -134.9443
quadrupole: -16.7791 -3.5186 5.9082
quadrupole: 7.5320 -2.4912 -5.0408 -16.7791 -3.5186 5.9082
hfenergy: -2056.2879566 hartree
pointgroup: C01 [X(C11H9Cl2N3O2S1)]
dipole: 1.1011572 -0.3973239 -0.1182912 debye
polarizability: 340.2483691|16.6963895|182.2820906|28.7933211|-35.4139353|114.8107644 unknown
InChI: InChI=1S/C11H9Cl2N3O2S/c1-19-11-15-9(17)8(10(18)16-11)14-5-2-3-6(12)7(13)4-5/h2-4,14-15,18H,1H3
charge 0 multiplicity 1
28 atoms
Cl -3.282984 2.893705 -0.329616
Cl -5.829288 0.870034 -0.88935
S  5.168341 0.949238 0.553901
O  0.635624 0.679585 -1.641638
O  1.577578 -2.277319 2.111812
N  -0.349145 -1.391959 0.366359
N  3.14602 -0.728381 1.291768
N  2.638172 0.737474 -0.5050
C  0.907009 -0.754956 0.356994
C  -1.605185 -0.828615 0.087633
C  1.852416 -1.317148 1.322025
C  1.373163 0.193081 -0.57312
C  -1.805157 0.582003 0.020218
C  -2.721912 -1.692692 -0.114557
C  3.482242 0.283267 0.404052
C  -3.087396 1.094722 -0.271948
C  -3.99058 -1.161233 -0.392827
C  -4.181534 0.237077 -0.490605
C  5.118687 2.208389 -0.842113
H  -0.329885 -2.289022 0.868128
H  -1.011902 1.278475 0.305645
H  -2.585458 -2.778031 -0.064428
H  3.823818 -1.095023 1.96824
H  -4.843531 -1.826991 -0.552785
H  -0.317655 0.391723 -1.608584
H  6.116153 2.673685 -0.847346
H  4.332856 2.947416 -0.637272
H  4.911535 1.692797 -1.789185
