program: Gaussian 09
title: 000247415
version: EM64L-G09RevD.01
frameworkgroup: C1[X(C20H22)]
method: RPBEPBE
basis: SDD
operation: Freq
keyword: #p
keyword: freq=noraman
keyword: PBEPBE/SDD
title: #p freq=noraman PBEPBE/SDD
converged: YES YES NO NO
title: Mulliken charges:
elementType: C C C C C C C C C C C C C C C C C C C C H H H H H H H H H H H H H H H H H H H H H H
charge: -0.068227 -0.305368 -0.501811 -0.507928 0.148579 0.158105 -0.618464 -0.567546 0.382221 0.279990 0.276593 0.270171 -0.481511 -0.404723 -0.440988 -0.443631 -0.244628 -0.251871 -0.852348 -0.858118 0.227366 0.214005 0.236289 0.214024 0.213667 0.232628 0.229486 0.207529 0.224341 0.223562 0.235743 0.231987 0.226057 0.231605 0.223402 0.222674 0.252986 0.222606 0.247541 0.255085 0.229724 0.229194
chargesum: 0.00000
title: Mulliken charges with hydrogens summed into heavy atoms:
elementType: C C C C C C C C C C C C C C C C C C C C
charge: 0.159139 -0.091363 -0.051498 -0.061633 0.148579 0.158105 -0.181449 -0.119643 0.382221 0.279990 0.276593 0.270171 -0.245768 -0.172736 -0.214931 -0.212026 -0.021227 -0.029197 -0.129214 -0.144114
polarizability: 2.52832259e+02 -3.07525380e+00 1.95497838e+02 -1.15201089e+01 1.29481812e+00 1.61494610e+02
1716.lowfreq: -15.1252 -11.1073 -0.0004 -0.0004 0.0005 3.4573 44.9512 67.1123 79.0040
frequency: 44.8254 67.0978 78.9971 125.4348 131.0671 158.0324 177.5451 189.4845 198.7078 224.8178 240.8227 278.4346 298.9474 311.0607 337.3136 351.9533 416.1355 432.4701 459.2223 471.2141 484.2939 498.7536 512.8919 521.5377 529.7812 553.1343 568.7208 588.0601 612.6488 680.3150 702.9109 744.8275 754.8663 773.7082 783.6285 804.7759 812.6722 843.8880 861.7140 882.4483 899.9104 903.6026 924.5594 950.8903 963.6394 972.9261 976.3288 989.0318 1006.8887 1023.3319 1030.9801 1038.9946 1045.2749 1053.7765 1068.7057 1090.6100 1097.5727 1114.7198 1143.8201 1152.9969 1163.7814 1175.3287 1177.6389 1188.9179 1213.7176 1223.4931 1242.0951 1245.6293 1257.5718 1258.1359 1269.6895 1293.9226 1298.2519 1317.3121 1329.4877 1336.2452 1342.9460 1359.6559 1369.1448 1378.9050 1398.1831 1408.1003 1428.4749 1444.3655 1454.2638 1457.9960 1460.7834 1465.0284 1468.9988 1471.8730 1473.3266 1473.4947 1482.1736 1487.2915 1588.5556 1595.1940 1601.8247 1605.3837 2931.2386 2956.3065 2960.6313 2963.0507 2969.0204 2974.8579 2982.4324 2990.5656 3010.3321 3035.0205 3040.5828 3045.2256 3045.6038 3073.2674 3083.1844 3088.1006 3109.1464 3114.2767 3120.5372 3123.5812 3149.6907 3151.5832
redmass: 3.6488 3.9578 3.3608 2.7850 3.3285 1.8109 1.6072 1.3738 1.5637 2.1574 2.6828 3.6801 3.2667 3.1228 2.8977 3.7003 3.0746 3.0579 3.0828 4.1631 3.3578 3.5823 2.9892 4.3165 4.1816 4.1996 3.9753 3.4793 2.6461 3.0737 5.1203 3.0555 4.4748 1.3055 1.3793 3.2952 1.9963 2.6109 2.6893 2.9077 1.3401 1.3842 2.2203 2.2302 2.0717 1.3906 1.3458 2.2388 1.9228 1.9280 1.8582 1.7084 1.5820 2.4020 2.1774 1.8488 2.2505 1.9637 1.3837 1.9157 1.4010 1.2447 1.3045 1.3838 1.4386 2.4240 1.7152 1.6877 2.3834 1.8157 1.5368 1.2898 1.2569 1.4456 1.6257 1.4970 1.5241 1.8137 3.9818 3.3311 1.2518 1.2455 2.3985 1.8546 2.4638 2.0908 1.2523 1.0947 1.0945 1.1260 1.1243 1.0747 1.1629 1.2186 7.3284 6.8289 6.0743 6.0664 1.0804 1.0629 1.0668 1.0796 1.0391 1.0664 1.0616 1.0371 1.0945 1.1027 1.0972 1.1000 1.0953 1.0976 1.0989 1.0981 1.0864 1.0853 1.0906 1.0914 1.0991 1.0994
irintensity: 0.0569 0.0742 0.2300 0.3116 1.3097 0.8204 0.2605 0.4055 0.2737 0.4502 1.4426 1.1260 7.5126 1.8993 4.9856 0.2772 1.4577 0.0651 0.8592 1.9637 0.1689 0.2529 0.0231 0.1528 1.0640 1.3005 0.3667 0.0232 2.3595 9.4517 2.6172 6.4586 2.4763 44.7665 41.8336 2.7564 4.9509 7.2291 5.3874 5.6151 0.8386 0.5543 1.6596 3.6172 2.3936 0.4839 0.6379 1.8360 1.8186 1.2039 0.8723 11.2592 6.6741 0.3303 0.0607 16.6666 10.9623 1.8251 0.8615 2.0821 1.0793 2.0613 1.1172 4.0859 0.9672 1.0109 1.2655 1.7437 0.5034 1.7208 2.3466 0.5517 4.4919 3.2737 2.6520 1.2301 0.5226 0.6061 0.2633 1.0305 13.4599 8.5730 0.5042 5.1036 10.0109 4.8907 8.7831 2.9719 16.6824 21.0073 9.2910 14.0147 33.4115 23.7966 5.4407 9.4843 0.5668 0.6296 16.9278 29.9406 34.5634 11.7831 27.5357 33.6893 47.3197 27.4178 31.3559 33.5892 77.6885 34.4730 25.0835 19.6601 21.9950 18.8981 5.0075 0.6844 24.9508 29.5218 46.8035 39.4988
temp: 298.150 k
press: 1.00000 atm
elementType: 6 6 6 6 6 6 6 6 6 6 6 6 6 6 6 6 6 6 6 6 1 1 1 1 1 1 1 1 1 1 1 1 1 1 1 1 1 1 1 1 1 1
symmnumber: 1
zpe: 945547.1 jmol-1
zpe.correction: 0.360140 hartree
zpe.thermalcorrener: 0.376991 hartree
zpe.thermalcorrenthalpy: 0.377936 hartree
zpe.thermalcorrgfe: 0.316990 hartree
zpe.sumelectzpe: -773.910176 hartree
zpe.sumelectthermal: -773.893325 hartree
zpe.sumelectthermalent: -773.892381 hartree
zpe.sumelectthermalfe: -773.953326 hartree
dipole: 0.0785 0.8179 0.2674
dipole: 0.8641
quadrupole: -115.7125 -114.4835 -117.5221
quadrupole: -1.9615 -2.5542 0.2096
quadrupole: 0.1935 1.4225 -1.6160 -1.9615 -2.5542 0.2096
hfenergy: -774.2703164 hartree
pointgroup: C01 [X(C20H22)]
dipole: 0.0285669 0.3252686 0.0946437 debye
polarizability: 253.0648929|-3.2085358|195.5170886|-10.5633715|0.073259|161.2427257 unknown
InChI: InChI=1S/C20H22/c1-13-5-3-7-15-9-11-17-12-10-16-8-4-6-14(2)19(16)20(17)18(13)15/h3-8,17,20H,9-12H2,1-2H3
charge 0 multiplicity 1
42 atoms
C  -0.298394 2.0674 0.291879
C  -0.08212 0.555857 0.653976
C  -1.7688 2.522947 0.540166
C  0.155978 2.299734 -1.165187
C  -1.23544 -0.292378 0.068127
C  1.366745 0.135898 0.401046
C  -2.587217 1.443559 1.302762
C  1.671678 2.055141 -1.306137
C  -2.525245 0.153192 0.505768
C  2.181963 0.841284 -0.528791
C  -1.151867 -1.411735 -0.8186
C  1.929935 -0.942052 1.156376
C  -3.700775 -0.526564 0.12216
C  3.527395 0.439103 -0.727743
C  -2.355956 -2.077926 -1.181254
C  3.276153 -1.318403 0.93911
C  -3.61736 -1.661057 -0.711641
C  4.076016 -0.638027 -0.006592
C  0.136974 -1.944589 -1.431786
C  1.105987 -1.693858 2.190316
H  0.37251 2.649031 0.958504
H  -0.225842 0.493481 1.754973
H  -2.269129 2.706961 -0.430294
H  -1.782807 3.479333 1.096056
H  -0.088481 3.330402 -1.487355
H  -0.414272 1.613527 -1.82312
H  -3.634799 1.769131 1.435451
H  -2.160793 1.3138 2.319597
H  2.215702 2.949356 -0.935677
H  1.948654 1.954671 -2.374183
H  -4.674377 -0.160454 0.469312
H  4.144537 0.983218 -1.454236
H  -2.291606 -2.940709 -1.855514
H  3.698843 -2.150435 1.51514
H  -4.522524 -2.201816 -1.010021
H  5.115651 -0.943015 -0.171303
H  0.79117 -2.427617 -0.684963
H  -0.09983 -2.695367 -2.20576
H  0.738872 -1.149039 -1.901442
H  0.153613 -2.067499 1.771247
H  1.66781 -2.556516 2.587091
H  0.842852 -1.045773 3.049541
