program: Gaussian 09
title: 000247414
version: EM64L-G09RevD.01
frameworkgroup: C1[X(C18H20O4)]
method: RPBEPBE
basis: SDD
operation: Freq
keyword: #pfreq=noraman
keyword: PBEPBE/SDD
title: #p freq=noraman PBEPBE/SDD
converged: YES YES NO NO
title: Mulliken charges:
elementType: O O O O C C C C C C C C C C C C C C C C C C H H H H H H H H H H H H H H H H H H H H
charge: -0.220751 -0.416957 -0.237082 -0.261816 -0.386747 -0.389519 -0.131822 -0.530173 0.086725 -0.717440 0.315876 0.162395 0.386647 -0.538085 0.410667 -0.387874 -0.426916 -0.436424 -0.556254 0.329451 -0.366926 -0.536816 0.190771 0.214196 0.235572 0.218258 0.241932 0.240005 0.229531 0.237997 0.223128 0.225095 0.254382 0.279054 0.241652 0.238885 0.265187 0.244689 0.374138 0.249418 0.222826 0.223119
chargesum: 0.00000
title: Mulliken charges with hydrogens summed into heavy atoms:
elementType: O O O O C C C C C C C C C C C C C C C C C C
charge: -0.220751 -0.042818 -0.237082 -0.261816 0.018220 0.064312 0.110110 -0.060636 0.086725 -0.031220 0.315876 0.162395 0.386647 -0.283702 0.410667 -0.108820 -0.185264 -0.197539 -0.291067 0.329451 -0.122236 0.158548
polarizability: 3.57134633e+02 -4.59717841e+01 2.10294851e+02 1.43588302e+01 1.08387985e+00 1.22622062e+02
1716.lowfreq: -10.6305 -0.0009 -0.0004 0.0006 1.7730 5.7656 13.5646 21.3126 23.8057
frequency: 13.2611 21.0476 23.2486 40.1529 48.1155 54.8015 90.6263 99.1079 102.3379 115.2693 162.8964 172.2115 192.4668 203.3299 217.3572 227.4721 232.8991 253.1283 274.3264 308.7258 327.0178 353.1616 380.4288 406.1503 443.2178 473.7293 478.3767 502.3996 509.8147 518.5513 548.7467 576.2717 591.1224 609.7343 637.3610 676.0984 697.1825 713.3297 728.4010 750.5050 769.6874 780.9538 805.7035 807.5631 832.8444 860.1820 894.7233 904.5372 912.0828 923.0765 939.8690 958.6046 977.2339 992.6216 1000.1402 1004.5108 1026.2351 1038.6449 1077.7193 1080.8349 1094.0627 1110.7277 1123.0054 1130.9027 1141.3022 1161.9474 1165.0921 1177.8751 1197.6134 1239.3826 1241.9198 1261.3367 1268.8136 1270.4394 1279.5999 1291.9949 1296.7804 1334.1978 1339.5939 1358.4333 1363.8662 1387.8853 1402.7763 1415.3902 1433.7449 1438.7375 1440.7989 1454.2166 1468.6867 1469.3168 1471.5827 1474.0904 1478.5536 1482.2212 1505.6468 1565.8757 1586.0827 1610.4398 1640.6442 1660.2008 2957.4058 2963.0923 2973.8834 2985.9707 2999.8848 3007.2792 3013.0658 3031.9348 3053.2597 3065.7153 3086.6020 3093.8442 3126.8496 3128.3290 3131.1699 3133.7540 3155.4398 3162.5359 3165.9192 3506.8436
redmass: 5.5273 5.3397 7.0664 4.4671 5.0493 6.3667 3.4826 2.2526 3.0099 3.3392 4.1077 2.7276 4.2031 1.8513 1.5192 3.7096 1.2939 4.1535 2.9248 5.9652 5.0128 4.8416 4.5814 3.1347 3.9114 2.5011 4.0328 3.2921 3.9780 6.5083 4.8408 3.3827 2.4561 1.2605 6.8034 2.9171 5.1295 3.3276 1.7913 4.3068 2.1876 2.2567 4.5787 1.5638 1.3682 1.5620 5.4624 1.7147 1.5555 1.9685 4.0834 1.4353 3.5810 1.6290 4.1113 1.3609 2.9881 2.6780 2.1592 1.7868 2.9968 1.2563 1.4654 1.6506 1.4502 1.2103 1.6266 1.7523 1.5289 1.4961 1.5455 1.7702 1.5380 1.5825 1.7448 1.1509 1.5846 1.9086 1.6786 1.6305 1.7043 1.2481 3.1071 4.4496 1.2140 1.5212 3.1844 1.0760 1.1495 1.1175 1.0833 1.0559 1.8761 1.0612 4.0107 7.1769 8.8441 6.0174 6.9304 8.1359 1.0608 1.0329 1.0596 1.0348 1.0604 1.0957 1.0871 1.0976 1.1043 1.1038 1.1004 1.1006 1.0942 1.0943 1.0891 1.0902 1.0920 1.0959 1.0945 1.0639
irintensity: 0.7790 0.7173 1.4496 0.2310 0.3106 0.2257 10.0570 0.1278 0.4670 0.5212 0.9281 2.5097 0.2595 0.1685 0.2071 6.0995 0.6187 10.9917 3.3530 0.1863 0.5697 0.9095 5.0995 0.0019 10.6108 18.6927 32.5807 1.4707 2.6507 3.5590 27.8263 9.2661 0.1930 116.0444 3.1660 3.3618 2.4999 33.2119 25.5959 5.4745 1.5965 3.6489 4.3475 23.7908 16.0767 8.3484 7.9523 60.1530 6.1616 0.4949 29.0364 5.0283 45.6806 24.6481 77.7765 1.1129 3.4007 307.9246 7.0134 3.8847 2.5465 0.1871 4.8281 23.3158 11.4547 113.1618 21.9546 220.2112 130.9058 52.7717 0.3991 188.5730 0.8103 10.5855 28.8542 2.1615 37.0493 1.4589 36.1919 24.5041 14.9156 14.7141 5.0550 11.0945 8.0779 4.3794 20.4520 4.1909 100.9219 75.7503 7.4027 21.3492 58.9252 15.6313 15.8246 139.9240 133.7560 7.1122 195.8093 191.6103 27.8549 87.1628 19.9902 31.0768 20.0307 8.1911 6.2785 7.2756 46.1660 40.3427 35.0507 29.7140 23.6164 6.5336 14.9654 7.5572 3.9844 10.2555 15.5316 20.4574
temp: 298.150 k
press: 1.00000 atm
elementType: 8 8 8 8 6 6 6 6 6 6 6 6 6 6 6 6 6 6 6 6 6 6 1 1 1 1 1 1 1 1 1 1 1 1 1 1 1 1 1 1 1 1
symmnumber: 1
zpe: 887274.5 jmol-1
zpe.correction: 0.337945 hartree
zpe.thermalcorrener: 0.359789 hartree
zpe.thermalcorrenthalpy: 0.360733 hartree
zpe.thermalcorrgfe: 0.283267 hartree
zpe.sumelectzpe: -997.210609 hartree
zpe.sumelectthermal: -997.188764 hartree
zpe.sumelectthermalent: -997.187820 hartree
zpe.sumelectthermalfe: -997.265287 hartree
dipole: 2.6361 -4.6309 -1.1251
dipole: 5.4461
quadrupole: -98.3344 -124.9548 -134.6141
quadrupole: -10.1584 4.3510 4.8406
quadrupole: 20.9667 -5.6537 -15.3130 -10.1584 4.3510 4.8406
hfenergy: -997.5485535 hartree
pointgroup: C01 [X(C18H20O4)]
dipole: 1.0303727 1.8010738 0.5343469 debye
polarizability: 357.6152641|46.2408495|209.9413904|-8.4132435|5.4631201|122.4948917 unknown
InChI: InChI=1S/C18H20O4/c1-12(18(20)21)4-3-5-17(19)15-7-6-14-11-16(22-2)9-8-13(14)10-15/h6-12,20H,3-5H2,1-2H3
charge 0 multiplicity 1
42 atoms
O  -1.530894 -2.361999 0.195903
O  -7.356897 -0.398639 -0.939433
O  -5.668065 0.778916 -2.007008
O  6.773234 0.497018 -0.151828
C  -4.245215 1.009168 0.541594
C  -3.396803 -0.25986 0.30861
C  -5.768782 0.750381 0.478781
C  -1.888216 0.046983 0.328111
C  -1.009392 -1.205736 0.216094
C  -6.588846 1.986209 0.950722
C  0.479686 -1.044459 0.140051
C  -6.201867 0.401597 -0.940084
C  2.533955 0.325366 0.090153
C  1.111133 0.20961 0.165021
C  3.342396 -0.876198 -0.014291
C  1.289469 -2.23273 0.038243
C  2.674064 -2.151134 -0.03678
C  3.19538 1.595149 0.112599
C  4.75942 -0.760723 -0.092243
C  5.374663 0.499985 -0.068314
C  4.585627 1.694087 0.035856
C  7.471482 1.78602 -0.134258
H  -4.009152 1.436384 1.537402
H  -3.987529 1.778162 -0.213293
H  -3.656329 -0.716508 -0.664698
H  -3.625497 -1.02157 1.077675
H  -6.034068 -0.10864 1.123734
H  -1.633955 0.743094 -0.497103
H  -1.617669 0.578543 1.265557
H  -7.674083 1.793129 0.894005
H  -6.332792 2.223318 1.998686
H  -6.355049 2.869918 0.329672
H  0.520789 1.130144 0.241343
H  0.769549 -3.195956 0.021498
H  3.278417 -3.062284 -0.115273
H  2.591133 2.506902 0.190944
H  5.387484 -1.653716 -0.172682
H  5.062642 2.678135 0.055073
H  -7.630526 -0.5769 -1.880549
H  8.538166 1.531126 -0.214571
H  7.290101 2.33104 0.812172
H  7.174937 2.418167 -0.99339
