program: Gaussian 09
title: 000247405
version: EM64L-G09RevD.01
frameworkgroup: C1[X(C15H15NO)]
method: RPBEPBE
basis: SDD
operation: Freq
keyword: #p
keyword: freq=noraman
keyword: PBEPBE/SDD
title: #p freq=noraman PBEPBE/SDD
converged: YES YES NO NO
title: Mulliken charges:
elementType: O N C C C C C C C C C C C C C C C H H H H H H H H H H H H H H H
charge: -0.224569 -0.312478 0.225910 0.290719 0.299660 0.328102 -0.336718 -0.328359 -0.354017 -0.399701 -0.820594 -0.823259 -0.233632 -0.246492 -0.244234 -0.236821 -0.098140 0.264654 0.259923 0.233338 0.232073 0.231459 0.240758 0.242544 0.230180 0.228112 0.252314 0.232555 0.230832 0.230137 0.228105 0.177638
chargesum: 0.00000
title: Mulliken charges with hydrogens summed into heavy atoms:
elementType: O N C C C C C C C C C C C C C C C
charge: -0.224569 -0.312478 0.225910 0.290719 0.299660 0.328102 -0.072064 -0.068437 -0.120679 -0.167628 -0.105833 -0.112652 -0.001078 -0.015660 -0.014097 -0.008717 0.079498
polarizability: 2.16441096e+02 3.95887504e-01 1.55298281e+02 -1.52488712e+01 2.17167222e+00 1.33439403e+02
1716.lowfreq: -9.0216 -0.0006 -0.0002 0.0004 5.5851 10.0480 38.3621 57.5824 68.6991
frequency: 38.3119 57.5743 68.6876 90.8533 132.6985 146.2086 168.4005 177.0666 189.4242 221.4772 262.6610 278.1982 308.5572 338.7646 383.4740 399.6952 445.5969 456.0147 478.5331 512.3191 535.4685 543.4043 576.1848 598.2445 656.3611 700.6378 718.7883 725.0013 760.7357 768.3573 791.4366 812.8727 867.0931 870.8049 928.9823 948.5392 952.7932 977.4005 983.0770 985.8092 987.4992 988.2695 1042.4366 1045.2469 1045.7823 1048.7931 1087.7101 1117.5242 1143.4952 1175.0296 1175.5305 1200.7623 1212.2674 1253.8773 1268.2461 1287.3024 1295.0666 1369.1816 1375.8853 1389.6276 1399.5922 1401.8921 1431.5806 1435.2255 1464.4553 1470.8687 1474.5635 1481.8027 1485.5145 1488.6670 1584.5039 1588.3453 1601.5681 1611.5329 1628.8217 2963.1716 2981.3392 2981.7987 3059.8708 3061.0086 3088.5807 3092.5645 3122.5477 3123.3659 3136.4610 3139.3427 3150.3278 3155.8799 3167.0058 3172.1031
redmass: 3.9445 4.2971 4.7460 5.5401 3.7105 1.2116 1.6435 2.2075 1.8548 3.6427 3.8463 3.8317 3.1695 3.2163 4.6118 3.1956 3.1063 2.9795 3.6893 4.6026 4.3005 5.4059 4.4791 5.2794 6.2120 4.9881 2.9696 2.4585 1.5859 1.3932 3.8052 4.4997 1.3275 1.3189 3.7657 1.4760 1.4575 1.5342 1.5777 1.4295 1.4722 1.3223 1.5266 2.0924 1.6401 2.0670 3.2586 1.7921 1.8113 1.0563 1.0582 2.3524 2.6032 3.2372 2.8501 1.5194 1.8291 7.3393 8.1858 1.2813 1.2431 1.2208 2.0711 2.1563 1.0982 1.1526 1.1839 1.2777 2.2136 1.8005 6.2601 6.5253 6.5203 6.5538 6.9330 1.0858 1.0387 1.0382 1.0951 1.0965 1.0992 1.0988 1.0870 1.0868 1.0883 1.0896 1.0940 1.0947 1.1008 1.0995
irintensity: 0.2462 0.5134 0.7100 0.5401 2.0756 1.1496 3.1724 2.0077 1.6413 0.5098 6.2774 6.7283 6.0037 2.1360 1.6419 2.0266 8.3067 7.1703 3.2083 4.1269 1.4012 2.8238 8.6794 11.1919 9.9428 8.7236 9.7092 25.8321 48.1641 60.1058 3.1829 0.8254 1.7810 0.3415 1.0190 1.4603 1.7749 9.3908 0.8601 0.6940 1.1533 0.1262 6.8057 5.8352 16.1273 8.8947 12.8904 26.1832 31.2927 0.4654 0.2509 14.7537 9.2088 92.8423 60.9252 5.2626 49.3889 1.7576 1.6344 18.3995 8.2297 20.3034 16.8439 13.6010 18.4718 1.7024 31.9829 2.6774 24.2188 90.3735 13.7954 3.8938 157.0922 4.9419 193.1683 69.4239 14.1464 34.5484 15.4963 14.9574 24.7370 12.8775 7.6297 6.2009 6.3881 13.2035 22.6901 27.6059 21.1796 12.1817
temp: 298.150 k
press: 1.00000 atm
elementType: 8 7 6 6 6 6 6 6 6 6 6 6 6 6 6 6 6 1 1 1 1 1 1 1 1 1 1 1 1 1 1 1
symmnumber: 1
zpe: 677746.4 jmol-1
zpe.correction: 0.258140 hartree
zpe.thermalcorrener: 0.273539 hartree
zpe.thermalcorrenthalpy: 0.274483 hartree
zpe.thermalcorrgfe: 0.215481 hartree
zpe.sumelectzpe: -709.372310 hartree
zpe.sumelectthermal: -709.356911 hartree
zpe.sumelectthermalent: -709.355967 hartree
zpe.sumelectthermalfe: -709.414969 hartree
dipole: -2.3486 -3.3354 0.6444
dipole: 4.1299
quadrupole: -89.3743 -108.9477 -94.7626
quadrupole: -8.4036 -2.9567 1.9723
quadrupole: 8.3206 -11.2529 2.9323 -8.4036 -2.9567 1.9723
hfenergy: -709.6304497 hartree
pointgroup: C01 [X(C15H15N1O1)]
dipole: -0.8900795 0.9411241 -0.9808735 debye
polarizability: 213.1278724|11.000442|151.8894459|19.3978885|-7.4657765|140.1614614 unknown
InChI: InChI=1S/C15H15NO/c1-12-7-3-5-9-14(12)16(11-17)15-10-6-4-8-13(15)2/h3-11H,1-2H3
charge 0 multiplicity 1
32 atoms
O  0.872505 -2.28912 2.168581
N  0.004125 -0.626201 0.721183
C  -1.206729 0.045578 0.282848
C  1.299279 -0.080667 0.341537
C  -2.312151 -0.682508 -0.252001
C  1.662294 0.027372 -1.032428
C  -1.261095 1.458782 0.39461
C  2.186054 0.337061 1.362417
C  -3.466001 0.056331 -0.626416
C  2.923636 0.59965 -1.336376
C  -2.294739 -2.187289 -0.466874
C  0.757957 -0.462542 -2.146741
C  -2.411941 2.167326 -0.001381
C  3.441614 0.8880 1.034175
C  -3.528432 1.460243 -0.505802
C  3.808788 1.0291 -0.323211
C  -0.09284 -1.652746 1.674902
H  -0.393326 1.991261 0.797459
H  1.891548 0.215018 2.408763
H  -4.323096 -0.489261 -1.039658
H  3.217466 0.693062 -2.388664
H  -2.896866 -2.454459 -1.352897
H  -2.723366 -2.735234 0.393917
H  -1.271566 -2.571528 -0.617132
H  0.408081 -1.493471 -1.955791
H  1.2907 -0.456082 -3.112548
H  -0.144201 0.168568 -2.251941
H  -2.440613 3.258291 0.091487
H  4.124047 1.204425 1.830081
H  -4.431982 1.998107 -0.812558
H  4.779973 1.459615 -0.591021
H  -1.149122 -1.837182 1.966781
