program: Gaussian 09
title: 000020218
version: EM64L-G09RevD.01
frameworkgroup: C1[X(C10H14O2)]
method: RPBEPBE
basis: SDD
operation: Freq
keyword: #pfreq=noraman
keyword: PBEPBE/SDD
title: #p freq=noraman PBEPBE/SDD
converged: YES YES NO NO
title: Mulliken charges:
elementType: O O C C C C C C C C C C H H H H H H H H H H H H H H
charge: -0.167370 -0.162681 0.297732 0.231154 -0.309160 -0.611166 -0.556320 0.068423 0.100276 -0.757931 -0.760303 -0.796115 0.286706 0.268663 0.274014 0.268374 0.275469 0.223787 0.238118 0.220781 0.222779 0.224591 0.236549 0.240361 0.212522 0.230745
chargesum: 0.00000
title: Mulliken charges with hydrogens summed into heavy atoms:
elementType: O O C C C C C C C C C C
charge: -0.167370 -0.162681 0.297732 0.231154 -0.022454 -0.068490 -0.012476 0.068423 0.100276 -0.075244 -0.076383 -0.112487
polarizability: 1.11026620e+02 7.02340800e-01 1.00723476e+02 -1.02867317e+00 3.58979297e-01 9.85418209e+01
1716.lowfreq: -0.0008 -0.0008 -0.0004 17.0992 20.6966 28.3131 91.2345 125.2845 150.7582
frequency: 91.2239 125.2406 150.7223 181.2604 200.1576 205.1451 227.6405 246.1722 285.6944 318.6423 334.0014 370.6259 448.8469 461.7203 495.9809 504.9991 549.4204 579.0377 595.3660 631.3916 679.0424 745.3864 774.3496 861.3085 902.5631 910.4916 939.9444 947.6038 951.7231 974.4584 998.3039 1028.9627 1044.5798 1076.9281 1122.1391 1134.7200 1143.1667 1164.0721 1191.4624 1199.1491 1214.0053 1239.7599 1260.4591 1278.5152 1305.4254 1387.6292 1391.8268 1405.5923 1435.4461 1442.1222 1464.5677 1467.3991 1471.0205 1480.3573 1488.3551 1492.7147 1669.9198 1676.3910 2979.8038 2982.1988 2985.3779 3008.7276 3019.0290 3065.0075 3066.6793 3070.9899 3075.2581 3078.9448 3080.8007 3082.5959 3084.0607 3097.8766
redmass: 7.2277 4.5825 1.0547 1.2092 1.1719 1.9041 2.5485 2.5017 3.4522 2.1955 2.9922 2.6563 2.8086 5.2721 3.6814 4.9400 3.1409 2.7566 2.7548 3.6849 3.1393 2.6124 2.8186 2.9850 2.0536 1.8215 2.1649 1.4207 1.8157 1.8115 1.3227 2.9463 1.9930 1.5790 1.8588 1.8573 2.4155 2.1154 1.7161 1.9391 1.8653 2.8733 2.2799 1.8001 3.3767 1.1974 1.2408 1.1862 1.0751 1.0773 1.0486 1.0509 1.0524 1.0517 1.0555 1.0593 11.8251 11.7317 1.0362 1.0365 1.0364 1.0604 1.0604 1.1015 1.0993 1.0983 1.1015 1.0994 1.0993 1.0986 1.0982 1.0905
irintensity: 7.1685 2.0924 0.1640 0.0613 0.2617 0.1548 0.4298 0.4268 5.1345 1.1399 2.6107 0.2313 0.9186 5.9019 8.0699 0.3998 1.3897 0.2308 1.4157 3.4716 0.6610 8.4065 6.6572 0.9432 2.2273 7.0036 8.8414 0.5214 9.4414 6.1952 4.0326 59.5769 2.8182 7.1397 5.2053 3.8798 17.4252 10.2167 5.7284 4.8226 22.4936 14.5928 8.6036 5.5102 1.9209 14.6957 20.5325 25.1989 37.6188 9.8542 10.6297 18.7092 4.0786 1.4994 6.4436 3.2801 227.9809 173.3825 20.2432 20.7300 28.3391 7.3754 6.9936 6.1636 0.4180 39.8221 15.3745 17.6468 20.1199 7.5060 46.5746 18.4578
temp: 298.150 k
press: 1.00000 atm
elementType: 8 8 6 6 6 6 6 6 6 6 6 6 1 1 1 1 1 1 1 1 1 1 1 1 1 1
symmnumber: 1
zpe: 568480.4 jmol-1
zpe.correction: 0.216523 hartree
zpe.thermalcorrener: 0.228373 hartree
zpe.thermalcorrenthalpy: 0.229317 hartree
zpe.thermalcorrgfe: 0.180148 hartree
zpe.sumelectzpe: -538.984161 hartree
zpe.sumelectthermal: -538.972311 hartree
zpe.sumelectthermalent: -538.971367 hartree
zpe.sumelectthermalfe: -539.020536 hartree
dipole: -0.8364 3.1089 -0.4612
dipole: 3.2523
quadrupole: -90.3921 -74.3309 -66.5135
quadrupole: -2.6737 -1.4007 0.3012
quadrupole: -13.3133 2.7479 10.5653 -2.6737 -1.4007 0.3012
hfenergy: -539.2006842 hartree
pointgroup: C01 [X(C10H14O2)]
dipole: 0.3337725 -1.2235494 -0.1696875 debye
dipolederiv: -0.7627787 -0.3530906 -0.0705273 -0.3562531 -0.6210279 0.0458088 -0.0896325 0.0404367 -0.3957675 -1.0591876 0.2053021 0.0185559 0.2146727 -0.3495746 -0.0476453 0.0264356 -0.046966 -0.4280302 0.1510752 0.006672 -0.051273 -0.0029655 0.2054933 0.0372065 0.0414422 0.0446636 0.0510977 -0.0601765 -0.1914892 0.1408513 -0.1473646 -0.1519874 0.1011805 0.1438296 0.1485394 -0.0966964 -0.2197134 0.1177767 0.2037303 0.0669662 -0.0638092 -0.0024908 0.2373483 -0.0344921 -0.1653075 -0.1481073 0.0636902 -0.2508013 -0.0195202 0.0395901 -0.0085567 -0.2490317 -0.0001114 -0.2873992 -0.0818844 -0.0088525 -0.2392411 0.0594962 0.0275846 0.0337745 -0.2215565 0.043636 -0.2753714 0.7961034 0.4409131 0.1933158 0.487286 0.6612477 -0.2466165 0.1557311 -0.2882755 0.6008003 1.2069281 -0.2628429 0.0262582 -0.2919587 0.1920909 0.1698503 -0.0699894 0.1767057 0.7662713 0.0076097 -0.0453657 0.0408398 -0.0522805 -0.0489388 0.0354952 0.0169607 0.0054502 0.0130916 -0.039014 0.0299083 0.0586863 0.0446454 -0.0025179 -0.0327991 0.0501082 -0.0088444 0.0047815 -0.0065717 0.0113224 -0.0427254 0.0089965 0.0147933 -0.0153405 -0.0722898 -0.0187765 0.0047931 -0.0079824 -0.0319711 -0.084386 -0.0331047 0.0420018 -0.0570861 -0.0811647 -0.0425554 -0.0349275 0.0597173 0.0030041 -0.0272643 0.0148557 -0.052961 -0.0830371 0.0104533 -0.0440535 0.0834841 0.0223261 -0.0435877 0.0518427 -0.0288268 0.0512933 0.1051665 0.0357674 0.0715532 0.022044 0.0527731 0.0481649 -0.0355807 0.035771 -0.0679206 0.0222421 0.0079328 -0.0123771 0.1101744 -0.0007976 -0.012935 0.1000072 -0.0240762 0.1122087 -0.0414782 0.0509096 -0.0208372 -0.0156446 0.0531127 -0.0670966 -0.0494437 -0.0574523 -0.0214224 -0.0647108 -0.0777804 -0.1286928 -0.0407896 -0.0439231 0.0472567 0.1037232 0.0639684 0.0757155 -0.0459107 0.116777 -0.0171534 -0.0036585 -0.0099474 0.1099077 -0.0838857 0.0596855 -0.0080282 0.0697634 -0.0578918 0.1031923 0.0224208 0.0354035 -0.0666097 -0.0976411 -0.0266711 0.0175439 -0.0973536 -0.0418741 -0.1144172 -0.0556123 -0.0041375 0.1015309 -0.0298942 0.1013269 -0.021217 0.0502497 -0.0745581 0.0961317 0.0278572 0.0082074 -0.0950082 0.0559917 -0.1125365 -0.0282536 0.0796498 0.0593767 0.0533114 0.0466883 0.0677797 -0.0226613 -0.0486291 -0.0613485 -0.0209025 -0.1225791 -0.0499172 -0.0703545 0.0121869 0.0416892 -0.0653025 0.0661917 -0.0299313 -0.0324156 0.1284272 0.0276133 0.1047465 -0.0002147 -0.0585039 0.081364 0.051299 0.0866193 0.0514135 -0.0132099 0.1050002 -0.0404597 0.033728 unknown
polarizability: 110.9802146|0.7251312|100.7219048|1.2689947|-0.3531513|98.5897979 unknown
InChI: InChI=1S/C10H14O2/c1-9(2)6-4-8(12)10(9,3)5-7(6)11/h6H,4-5H2,1-3H3
charge 0 multiplicity 1
26 atoms
O  2.071602 1.816579 -0.106768
O  -2.883062 0.786113 0.240094
C  0.067016 -1.12373 -0.358647
C  0.650463 -0.084958 0.698753
C  -0.902535 -0.074362 -1.029846
C  -0.663402 0.481545 1.351851
C  0.058322 1.101485 -1.403328
C  1.085138 1.059957 -0.249554
C  -1.680259 0.444269 0.18949
C  -0.690363 -2.315024 0.271236
C  1.146423 -1.683005 -1.314311
C  1.721913 -0.54378 1.681912
H  -1.540764 -0.433129 -1.850082
H  -0.555832 1.504377 1.75688
H  -1.00667 -0.159348 2.184417
H  -0.436769 2.087081 -1.465972
H  0.564056 0.930016 -2.369946
H  -1.11585 -2.951732 -0.526815
H  -1.526799 -2.010683 0.924371
H  -0.003106 -2.943375 0.867113
H  0.675169 -2.235385 -2.148121
H  1.799908 -2.392917 -0.774818
H  1.798113 -0.904181 -1.747659
H  2.068972 0.306268 2.295933
H  1.335576 -1.325863 2.360782
H  2.607637 -0.942617 1.156233
