program: Gaussian 09
title: 000247352
version: EM64L-G09RevD.01
frameworkgroup: C1[X(C16H11NO2)]
method: RPBEPBE
basis: SDD
operation: Freq
keyword: #p
keyword: freq=noraman
keyword: PBEPBE/SDD
title: #p freq=noraman PBEPBE/SDD
converged: YES YES NO NO
title: Mulliken charges:
elementType: O O N C C C C C C C C C C C C C C C C H H H H H H H H H H H
charge: -0.214716 -0.283520 -0.637174 0.180299 0.181537 0.209348 -0.009542 -0.167241 0.326447 -0.362313 -0.413788 -0.233010 -0.323333 -0.400825 0.124384 -0.226084 -0.244436 -0.247401 -0.231026 0.277874 0.282162 0.234827 0.279070 0.263220 0.239358 0.234672 0.231781 0.233373 0.326261 0.369795
chargesum: 0.00000
title: Mulliken charges with hydrogens summed into heavy atoms:
elementType: O O N C C C C C C C C C C C C C C C C
charge: -0.214716 -0.283520 0.058882 0.180299 0.181537 0.209348 -0.009542 -0.167241 0.326447 -0.084439 -0.131626 0.001817 -0.044264 -0.137605 0.124384 0.013274 -0.009764 -0.015620 0.002348
polarizability: 2.83701472e+02 -1.24914695e+01 2.35803382e+02 -5.13994807e+00 -8.13528264e+00 8.87446280e+01
1716.lowfreq: -6.0859 -2.8880 -0.0011 -0.0005 -0.0003 3.8259 38.0803 66.7118 73.6715
frequency: 38.0428 66.7034 73.6698 83.7418 103.3445 154.8119 184.7488 221.5108 251.6750 270.7045 301.1988 333.7810 346.5134 387.7994 403.2468 416.7849 441.4960 493.0710 539.9800 571.8273 586.8493 612.2463 620.1250 643.8242 675.8629 679.1331 689.4056 695.6987 746.7257 750.5294 764.2812 788.7959 822.4077 836.0615 843.5990 868.5747 903.6473 913.6775 929.9661 966.0691 975.3690 988.2236 995.9903 998.2860 1018.3329 1028.8741 1076.8446 1088.2345 1099.6952 1135.9086 1159.7996 1175.5767 1178.3878 1197.3529 1202.3818 1279.5787 1286.1077 1326.4219 1355.9644 1378.2159 1420.5555 1433.2248 1445.1838 1456.5515 1475.8920 1538.8005 1559.0837 1574.7607 1595.7744 1605.4663 1608.4215 1618.0258 1620.9467 3128.1528 3135.8657 3138.8079 3149.2605 3151.8079 3159.9404 3165.1534 3171.4711 3198.9997 3382.9193 3628.5938
redmass: 8.2926 4.1513 5.1957 5.6359 4.8801 5.9851 5.5242 5.2413 5.6329 6.6200 6.2637 7.3838 6.9098 5.4273 2.8939 3.1347 4.4342 3.7991 7.5346 4.0913 1.3485 5.8904 6.1423 4.3447 5.7565 4.8887 3.0837 1.9644 2.1900 1.2841 1.5169 3.0975 4.0422 3.6773 1.4903 5.0542 1.4603 4.8377 1.5501 1.4292 1.3890 5.5598 1.3530 1.3616 2.1834 2.2714 2.4233 1.6789 1.9167 4.9009 2.0053 1.0581 1.2508 1.8373 1.4653 1.7338 2.8932 1.4956 3.2079 6.8273 4.7579 2.4397 2.4166 3.1090 2.2666 6.1410 3.2917 5.7126 7.6152 3.5529 7.4212 3.3341 3.6512 1.0851 1.0862 1.0890 1.0910 1.0940 1.0948 1.0998 1.1002 1.0953 1.0567 1.0949
irintensity: 2.0369 0.8544 1.0355 4.7865 0.1931 0.3385 5.1380 0.7254 3.9445 5.6426 0.8635 5.2351 8.3482 9.8576 3.1501 1.5693 2.1171 4.8825 5.5573 19.2574 132.5100 3.4711 10.3150 1.5622 1.2058 9.3179 13.1578 55.0577 14.1572 175.8318 58.8448 27.1187 1.7560 17.5717 2.8411 6.1566 0.0452 17.4667 1.8292 2.3422 3.6540 2.6917 0.1882 0.1180 1.7259 9.8963 15.4501 7.1735 6.2781 34.2930 9.6726 0.7811 8.4285 45.8968 9.1159 19.1251 82.6869 13.4136 162.0530 8.2099 1.5864 17.0753 20.6239 4.9367 6.0711 435.6270 76.1777 25.3527 222.1546 54.9719 312.5948 3.1650 16.3363 0.4200 1.1746 7.2025 15.1380 18.1537 3.2040 36.5067 24.5722 4.5729 83.2543 89.5816
temp: 298.150 k
press: 1.00000 atm
elementType: 8 8 7 6 6 6 6 6 6 6 6 6 6 6 6 6 6 6 6 1 1 1 1 1 1 1 1 1 1 1
symmnumber: 1
zpe: 594133.3 jmol-1
zpe.correction: 0.226293 hartree
zpe.thermalcorrener: 0.241140 hartree
zpe.thermalcorrenthalpy: 0.242084 hartree
zpe.thermalcorrgfe: 0.183832 hartree
zpe.sumelectzpe: -820.233656 hartree
zpe.sumelectthermal: -820.218809 hartree
zpe.sumelectthermalent: -820.217865 hartree
zpe.sumelectthermalfe: -820.276117 hartree
dipole: -0.6249 -4.0984 -0.1614
dipole: 4.1489
quadrupole: -100.2786 -97.0650 -110.4367
quadrupole: -1.4461 -1.1644 -2.3785
quadrupole: 2.3148 5.5284 -7.8432 -1.4461 -1.1644 -2.3785
hfenergy: -820.459949 hartree
pointgroup: C01 [X(C16H11N1O2)]
dipole: 0.3890373 1.5757066 0.1739451 debye
polarizability: 279.6347777|-19.1888141|233.9345872|15.613569|26.0128218|94.6801171 unknown
InChI: InChI=1S/C16H11NO2/c17-16(19)14-13(10-6-2-1-3-7-10)11-8-4-5-9-12(11)15(14)18/h1-9H,17H2
charge 0 multiplicity 1
30 atoms
O  2.58975 -2.446767 0.016931
O  -1.763399 -2.692404 -0.423415
N  0.23069 -3.85463 -0.183009
C  -0.13307 -0.111853 -0.003467
C  1.065504 0.787426 0.163508
C  2.238529 -0.013665 0.178343
C  0.315308 -1.433062 -0.125921
C  1.813839 -1.43956 0.016152
C  -1.501563 0.437291 -0.00151
C  1.176758 2.18643 0.225762
C  3.519566 0.534675 0.288408
C  2.476238 2.759815 0.343628
C  -2.490616 0.0189 -0.936631
C  -1.84752 1.4398 0.955448
C  -0.499401 -2.683396 -0.258303
C  3.632904 1.950843 0.38215
C  -3.774013 0.600785 -0.925992
C  -3.143028 1.992624 0.984574
C  -4.109111 1.58309 0.035187
H  0.296568 2.833231 0.165764
H  4.402999 -0.111941 0.292746
H  2.5775 3.849258 0.398627
H  -2.246855 -0.760595 -1.660029
H  -1.114175 1.742836 1.710465
H  4.620089 2.416238 0.472014
H  -4.519148 0.274034 -1.65891
H  -3.399724 2.737972 1.745142
H  -5.113809 2.020256 0.049008
H  -0.278056 -4.733631 -0.267701
H  1.253847 -3.828599 -0.078868
